BDBM25141 2-cyano-pyrropyrimidine, 7g::7-[2-(4,4-difluorocyclohexyl)ethyl]-6-[4-(4-acetylpiperazin-1-yl)phenoxymethyl]-7H-pyrrolo[2,3-d]pyrimidine-2-carbonitrile
SMILES: CC(=O)N1CCN(CC1)c1ccc(OCc2cc3cnc(nc3n2CCC2CCC(F)(F)CC2)C#N)cc1
InChI Key: InChIKey=DYLHJNWFUXMPCG-UHFFFAOYSA-N
Data: 6 IC50
Activity Spreadsheet -- Enzyme Inhibition Constant Data from BindingDB
Found 6 hits for monomerid = 25141
Trg + Lig
Ki
nM
ΔG°
kcal/mole
IC50
nM
Kd
nM
EC50/IC50
nM
koff
s-1
kon
M-1s-1
pHTemp
°C
Cathepsin S
(Homo sapiens (Human))
BDBM25141
(2-cyano-pyrropyrimidine, 7g | 7-[2-(4,4-difluorocy...)
Show SMILES CC(=O)N1CCN(CC1)c1ccc(OCc2cc3cnc(nc3n2CCC2CCC(F)(F)CC2)C#N)cc1
Show InChI InChI=1S/C28H32F2N6O2/c1-20(37)34-12-14-35(15-13-34)23-2-4-25(5-3-23)38-19-24-16-22-18-32-26(17-31)33-27(22)36(24)11-8-21-6-9-28(29,30)10-7-21/h2-5,16,18,21H,6-15,19H2,1H3
Reactome pathway
n/an/a 10n/an/an/an/a7.022
Novartis
Assay Description
The substrate hydrolysis with or without inhibitor was monitored at an excitation wavelength of 360nm and an emission wavelength of 460 nm on a fluor...
J Med Chem 51: 5502-5 (2008)
Article DOI: 10.1021/jm800839j
BindingDB Entry DOI: 10.7270/Q2125QZR
Cathepsin S
(Mus musculus (Mouse))
BDBM25141
(2-cyano-pyrropyrimidine, 7g | 7-[2-(4,4-difluorocy...)
Show SMILES CC(=O)N1CCN(CC1)c1ccc(OCc2cc3cnc(nc3n2CCC2CCC(F)(F)CC2)C#N)cc1
Show InChI InChI=1S/C28H32F2N6O2/c1-20(37)34-12-14-35(15-13-34)23-2-4-25(5-3-23)38-19-24-16-22-18-32-26(17-31)33-27(22)36(24)11-8-21-6-9-28(29,30)10-7-21/h2-5,16,18,21H,6-15,19H2,1H3
n/an/a 20n/an/an/an/a7.022
Novartis
Assay Description
The substrate hydrolysis with or without inhibitor was monitored at an excitation wavelength of 360nm and an emission wavelength of 460 nm on a fluor...
J Med Chem 51: 5502-5 (2008)
Article DOI: 10.1021/jm800839j
BindingDB Entry DOI: 10.7270/Q2125QZR
Cathepsin L
(Rattus norvegicus)
BDBM25141
(2-cyano-pyrropyrimidine, 7g | 7-[2-(4,4-difluorocy...)
Show SMILES CC(=O)N1CCN(CC1)c1ccc(OCc2cc3cnc(nc3n2CCC2CCC(F)(F)CC2)C#N)cc1
Show InChI InChI=1S/C28H32F2N6O2/c1-20(37)34-12-14-35(15-13-34)23-2-4-25(5-3-23)38-19-24-16-22-18-32-26(17-31)33-27(22)36(24)11-8-21-6-9-28(29,30)10-7-21/h2-5,16,18,21H,6-15,19H2,1H3
Reactome pathway
n/an/a>1.00E+4n/an/an/an/an/an/a
Novartis
Assay Description
The substrate hydrolysis with or without inhibitor was monitored at an excitation wavelength of 360nm and an emission wavelength of 460 nm on a fluor...
J Med Chem 51: 5502-5 (2008)
Article DOI: 10.1021/jm800839j
BindingDB Entry DOI: 10.7270/Q2125QZR
Cathepsin K
(Rattus norvegicus)
BDBM25141
(2-cyano-pyrropyrimidine, 7g | 7-[2-(4,4-difluorocy...)
Show SMILES CC(=O)N1CCN(CC1)c1ccc(OCc2cc3cnc(nc3n2CCC2CCC(F)(F)CC2)C#N)cc1
Show InChI InChI=1S/C28H32F2N6O2/c1-20(37)34-12-14-35(15-13-34)23-2-4-25(5-3-23)38-19-24-16-22-18-32-26(17-31)33-27(22)36(24)11-8-21-6-9-28(29,30)10-7-21/h2-5,16,18,21H,6-15,19H2,1H3
Reactome pathway
n/an/a>1.00E+4n/an/an/an/a7.022
Novartis
Assay Description
The substrate hydrolysis with or without inhibitor was monitored at an excitation wavelength of 360nm and an emission wavelength of 460 nm on a fluor...
J Med Chem 51: 5502-5 (2008)
Article DOI: 10.1021/jm800839j
BindingDB Entry DOI: 10.7270/Q2125QZR
Procathepsin L
(Homo sapiens (Human))
BDBM25141
(2-cyano-pyrropyrimidine, 7g | 7-[2-(4,4-difluorocy...)
Show SMILES CC(=O)N1CCN(CC1)c1ccc(OCc2cc3cnc(nc3n2CCC2CCC(F)(F)CC2)C#N)cc1
Show InChI InChI=1S/C28H32F2N6O2/c1-20(37)34-12-14-35(15-13-34)23-2-4-25(5-3-23)38-19-24-16-22-18-32-26(17-31)33-27(22)36(24)11-8-21-6-9-28(29,30)10-7-21/h2-5,16,18,21H,6-15,19H2,1H3
Reactome pathway
n/an/a 6.20E+3n/an/an/an/an/an/a
Novartis
Assay Description
The substrate hydrolysis with or without inhibitor was monitored at an excitation wavelength of 360nm and an emission wavelength of 460 nm on a fluor...
J Med Chem 51: 5502-5 (2008)
Article DOI: 10.1021/jm800839j
BindingDB Entry DOI: 10.7270/Q2125QZR
Cathepsin K
(Homo sapiens (Human))
BDBM25141
(2-cyano-pyrropyrimidine, 7g | 7-[2-(4,4-difluorocy...)
Show SMILES CC(=O)N1CCN(CC1)c1ccc(OCc2cc3cnc(nc3n2CCC2CCC(F)(F)CC2)C#N)cc1
Show InChI InChI=1S/C28H32F2N6O2/c1-20(37)34-12-14-35(15-13-34)23-2-4-25(5-3-23)38-19-24-16-22-18-32-26(17-31)33-27(22)36(24)11-8-21-6-9-28(29,30)10-7-21/h2-5,16,18,21H,6-15,19H2,1H3
Reactome pathway
n/an/a 5.40E+3n/an/an/an/a7.022
Novartis
Assay Description
The substrate hydrolysis with or without inhibitor was monitored at an excitation wavelength of 360nm and an emission wavelength of 460 nm on a fluor...
J Med Chem 51: 5502-5 (2008)
Article DOI: 10.1021/jm800839j
BindingDB Entry DOI: 10.7270/Q2125QZR