null
SMILES: COCCCN[C@H](CC(=O)N1CCN(CC1)c1nc(N)c2cc(OC)c(OC)c(F)c2n1)c1ccc(F)cc1
InChI Key: InChIKey=BBRWFWRSTSZURV-HXUWFJFHSA-N
Activity Spreadsheet -- Enzyme Inhibition Constant Data from BindingDB
Found 1 hit for monomerid = 251412
Trg + Lig
Ki
nM
ΔG°
kcal/mole
IC50
nM
Kd
nM
EC50/IC50
nM
koff
s-1
kon
M-1s-1
pHTemp
°C
Cobra venom factor/Complement factor B/Complement factor D
(Naja kaouthia (Monocled cobra) (Naja siamensis)-Ho...)
BDBM251412
(US9452990, 94)
Show SMILES COCCCN[C@H](CC(=O)N1CCN(CC1)c1nc(N)c2cc(OC)c(OC)c(F)c2n1)c1ccc(F)cc1 |r|
Show InChI InChI=1S/C27H34F2N6O4/c1-37-14-4-9-31-20(17-5-7-18(28)8-6-17)16-22(36)34-10-12-35(13-11-34)27-32-24-19(26(30)33-27)15-21(38-2)25(39-3)23(24)29/h5-8,15,20,31H,4,9-14,16H2,1-3H3,(H2,30,32,33)/t20-/m1/s1
US Patent
n/an/a 6n/an/an/an/a7.425
NOVARTIS AG
US Patent
Assay Description
CVF-Bb complex prepared from purified cobra venom factor (1 μM), recombinant human complement factor B (expressed in drosophila cells and purifi...
US Patent US9452990 (2016)
BindingDB Entry DOI: 10.7270/Q2H130Z9