BDBM251421 US9452990, 103
SMILES: COc1cc2c(N)nc(nc2c(F)c1OC)N1CCN(CC1)C(=O)C[C@@H](N1CCCC1)c1ccc(F)cc1
InChI Key: InChIKey=LFYOIWREGBSBDS-HXUWFJFHSA-N
Data: 1 IC50
Activity Spreadsheet -- Enzyme Inhibition Constant Data from BindingDB
Found 1 hit for monomerid = 251421
Trg + Lig
Ki
nM
ΔG°
kcal/mole
IC50
nM
Kd
nM
EC50/IC50
nM
koff
s-1
kon
M-1s-1
pHTemp
°C
CVF-Bb Complex
(Naja kaouthia (Monocled cobra) (Naja siamensis)-Ho...)
BDBM251421
(US9452990, 103)
Show SMILES COc1cc2c(N)nc(nc2c(F)c1OC)N1CCN(CC1)C(=O)C[C@@H](N1CCCC1)c1ccc(F)cc1 |r|
Show InChI InChI=1S/C27H32F2N6O3/c1-37-21-15-19-24(23(29)25(21)38-2)31-27(32-26(19)30)35-13-11-34(12-14-35)22(36)16-20(33-9-3-4-10-33)17-5-7-18(28)8-6-17/h5-8,15,20H,3-4,9-14,16H2,1-2H3,(H2,30,31,32)/t20-/m1/s1
US Patent
n/an/a 15n/an/an/an/a7.425
NOVARTIS AG
US Patent
Assay Description
CVF-Bb complex prepared from purified cobra venom factor (1 μM), recombinant human complement factor B (expressed in drosophila cells and purifi...
US Patent US9452990 (2016)
BindingDB Entry DOI: 10.7270/Q2H130Z9