null
SMILES: CN[C@H](CC(=O)N1CCN(CC1)c1nc(N)c2cc(OC)c(OC)c(F)c2n1)c1ccc(F)cc1
InChI Key: InChIKey=SDZYAEFSHKGZDN-QGZVFWFLSA-N
Activity Spreadsheet -- Enzyme Inhibition Constant Data from BindingDB
Found 1 hit for monomerid = 251451
Trg + Lig
Ki
nM
ΔG°
kcal/mole
IC50
nM
Kd
nM
EC50/IC50
nM
koff
s-1
kon
M-1s-1
pHTemp
°C
Cobra venom factor/Complement factor B/Complement factor D
(Naja kaouthia (Monocled cobra) (Naja siamensis)-Ho...)
BDBM251451
(US9452990, 80)
Show SMILES CN[C@H](CC(=O)N1CCN(CC1)c1nc(N)c2cc(OC)c(OC)c(F)c2n1)c1ccc(F)cc1 |r|
Show InChI InChI=1S/C24H28F2N6O3/c1-28-17(14-4-6-15(25)7-5-14)13-19(33)31-8-10-32(11-9-31)24-29-21-16(23(27)30-24)12-18(34-2)22(35-3)20(21)26/h4-7,12,17,28H,8-11,13H2,1-3H3,(H2,27,29,30)/t17-/m1/s1
US Patent
n/an/a 6n/an/an/an/a7.425
NOVARTIS AG
US Patent
Assay Description
CVF-Bb complex prepared from purified cobra venom factor (1 μM), recombinant human complement factor B (expressed in drosophila cells and purifi...
US Patent US9452990 (2016)
BindingDB Entry DOI: 10.7270/Q2H130Z9