BDBM25159 CHEMBL462208::N-[(1S)-1-phenylethyl]-5-(2,2,2-trifluoroacetyl)thiophene-2-carboxamide::thiophene derivative, 3e
SMILES: C[C@H](NC(=O)c1ccc(s1)C(=O)C(F)(F)F)c1ccccc1
InChI Key: InChIKey=DPKHRWMGXRDLLO-VIFPVBQESA-N
Data: 12 IC50
Activity Spreadsheet -- Enzyme Inhibition Constant Data from BindingDB
Found 12 hits for monomerid = 25159
Trg + Lig
Ki
nM
ΔG°
kcal/mole
IC50
nM
Kd
nM
EC50/IC50
nM
koff
s-1
kon
M-1s-1
pHTemp
°C
Histone deacetylase 1
(Homo sapiens (Human))
BDBM25159
(CHEMBL462208 | N-[(1S)-1-phenylethyl]-5-(2,2,2-tri...)
Show SMILES C[C@H](NC(=O)c1ccc(s1)C(=O)C(F)(F)F)c1ccccc1 |r|
Show InChI InChI=1S/C15H12F3NO2S/c1-9(10-5-3-2-4-6-10)19-14(21)12-8-7-11(22-12)13(20)15(16,17)18/h2-9H,1H3,(H,19,21)/t9-/m0/s1
NCI pathway
Reactome pathway
n/an/a 5.30E+3n/an/an/an/a8.037
IRBM/Merck
Assay Description
The Fluor-de-Lys HDAC activity assay kit (Biomol) was used. Purified recombinant HDAC enzyme was incubated with Fluor-de-Lys substrate in the presenc...
Bioorg Med Chem Lett 18: 3456-61 (2008)
Article DOI: 10.1016/j.bmcl.2008.02.026
BindingDB Entry DOI: 10.7270/Q2MS3R28
Histone deacetylase 3
(Homo sapiens (Human))
BDBM25159
(CHEMBL462208 | N-[(1S)-1-phenylethyl]-5-(2,2,2-tri...)
Show SMILES C[C@H](NC(=O)c1ccc(s1)C(=O)C(F)(F)F)c1ccccc1 |r|
Show InChI InChI=1S/C15H12F3NO2S/c1-9(10-5-3-2-4-6-10)19-14(21)12-8-7-11(22-12)13(20)15(16,17)18/h2-9H,1H3,(H,19,21)/t9-/m0/s1
NCI pathway
Reactome pathway
n/an/a 9.40E+3n/an/an/an/an/a25
IRBM/Merck
Assay Description
The Fluor-de-Lys HDAC activity assay kit (Biomol) was used. Purified recombinant HDAC enzyme was incubated with Fluor-de-Lys substrate in the presenc...
Bioorg Med Chem Lett 18: 3456-61 (2008)
Article DOI: 10.1016/j.bmcl.2008.02.026
BindingDB Entry DOI: 10.7270/Q2MS3R28
Histone Deacetylase 4 (HDAC4) Mutant (H976Y)
(Homo sapiens (Human))
BDBM25159
(CHEMBL462208 | N-[(1S)-1-phenylethyl]-5-(2,2,2-tri...)
Show SMILES C[C@H](NC(=O)c1ccc(s1)C(=O)C(F)(F)F)c1ccccc1 |r|
Show InChI InChI=1S/C15H12F3NO2S/c1-9(10-5-3-2-4-6-10)19-14(21)12-8-7-11(22-12)13(20)15(16,17)18/h2-9H,1H3,(H,19,21)/t9-/m0/s1
n/an/a 280n/an/an/an/an/a25
IRBM/Merck
Assay Description
The Fluor-de-Lys HDAC activity assay kit (Biomol) was used. Purified recombinant HDAC enzyme was incubated with Fluor-de-Lys substrate in the presenc...
Bioorg Med Chem Lett 18: 3456-61 (2008)
Article DOI: 10.1016/j.bmcl.2008.02.026
BindingDB Entry DOI: 10.7270/Q2MS3R28
Histone deacetylase 4
(Homo sapiens (Human))
BDBM25159
(CHEMBL462208 | N-[(1S)-1-phenylethyl]-5-(2,2,2-tri...)
Show SMILES C[C@H](NC(=O)c1ccc(s1)C(=O)C(F)(F)F)c1ccccc1 |r|
Show InChI InChI=1S/C15H12F3NO2S/c1-9(10-5-3-2-4-6-10)19-14(21)12-8-7-11(22-12)13(20)15(16,17)18/h2-9H,1H3,(H,19,21)/t9-/m0/s1
n/an/a 170n/an/an/an/an/a25
IRBM/Merck
Assay Description
The Fluor-de-Lys HDAC activity assay kit (Biomol) was used. Purified recombinant HDAC enzyme was incubated with Fluor-de-Lys substrate in the presenc...
Bioorg Med Chem Lett 18: 3456-61 (2008)
Article DOI: 10.1016/j.bmcl.2008.02.026
BindingDB Entry DOI: 10.7270/Q2MS3R28
Cereblon/Histone deacetylase 6
(Homo sapiens (Human))
BDBM25159
(CHEMBL462208 | N-[(1S)-1-phenylethyl]-5-(2,2,2-tri...)
Show SMILES C[C@H](NC(=O)c1ccc(s1)C(=O)C(F)(F)F)c1ccccc1 |r|
Show InChI InChI=1S/C15H12F3NO2S/c1-9(10-5-3-2-4-6-10)19-14(21)12-8-7-11(22-12)13(20)15(16,17)18/h2-9H,1H3,(H,19,21)/t9-/m0/s1
NCI pathway
Reactome pathway
n/an/a 210n/an/an/an/an/a25
IRBM/Merck
Assay Description
The Fluor-de-Lys HDAC activity assay kit (Biomol) was used. Purified recombinant HDAC enzyme was incubated with Fluor-de-Lys substrate in the presenc...
Bioorg Med Chem Lett 18: 3456-61 (2008)
Article DOI: 10.1016/j.bmcl.2008.02.026
BindingDB Entry DOI: 10.7270/Q2MS3R28
Cereblon/Histone deacetylase 6
(Homo sapiens (Human))
BDBM25159
(CHEMBL462208 | N-[(1S)-1-phenylethyl]-5-(2,2,2-tri...)
Show SMILES C[C@H](NC(=O)c1ccc(s1)C(=O)C(F)(F)F)c1ccccc1 |r|
Show InChI InChI=1S/C15H12F3NO2S/c1-9(10-5-3-2-4-6-10)19-14(21)12-8-7-11(22-12)13(20)15(16,17)18/h2-9H,1H3,(H,19,21)/t9-/m0/s1
NCI pathway
Reactome pathway
n/an/a 150n/an/an/an/an/an/a
IRBM-Merck Research Laboratories Rome
Curated by ChEMBL
Assay Description
Inhibition of HDAC6 purified from HEK293 cells by western blot
Bioorg Med Chem Lett 18: 6078-82 (2008)
Article DOI: 10.1016/j.bmcl.2008.10.041
BindingDB Entry DOI: 10.7270/Q2V987XH
Cereblon/Histone deacetylase 6
(Homo sapiens (Human))
BDBM25159
(CHEMBL462208 | N-[(1S)-1-phenylethyl]-5-(2,2,2-tri...)
Show SMILES C[C@H](NC(=O)c1ccc(s1)C(=O)C(F)(F)F)c1ccccc1 |r|
Show InChI InChI=1S/C15H12F3NO2S/c1-9(10-5-3-2-4-6-10)19-14(21)12-8-7-11(22-12)13(20)15(16,17)18/h2-9H,1H3,(H,19,21)/t9-/m0/s1
NCI pathway
Reactome pathway
n/an/a 210n/an/an/an/an/an/a
IRBM-Merck Research Laboratories Rome
Curated by ChEMBL
Assay Description
Inhibition of HDAC6 (unknown origin)
Bioorg Med Chem Lett 18: 6083-7 (2008)
Article DOI: 10.1016/j.bmcl.2008.09.076
BindingDB Entry DOI: 10.7270/Q2TD9X6G
Histone deacetylase 1
(Homo sapiens (Human))
BDBM25159
(CHEMBL462208 | N-[(1S)-1-phenylethyl]-5-(2,2,2-tri...)
Show SMILES C[C@H](NC(=O)c1ccc(s1)C(=O)C(F)(F)F)c1ccccc1 |r|
Show InChI InChI=1S/C15H12F3NO2S/c1-9(10-5-3-2-4-6-10)19-14(21)12-8-7-11(22-12)13(20)15(16,17)18/h2-9H,1H3,(H,19,21)/t9-/m0/s1
NCI pathway
Reactome pathway
n/an/a 5.30E+3n/an/an/an/an/an/a
IRBM-Merck Research Laboratories Rome
Curated by ChEMBL
Assay Description
Inhibition of HDAC1 (unknown origin)
Bioorg Med Chem Lett 18: 6083-7 (2008)
Article DOI: 10.1016/j.bmcl.2008.09.076
BindingDB Entry DOI: 10.7270/Q2TD9X6G
Histone deacetylase 3
(Homo sapiens (Human))
BDBM25159
(CHEMBL462208 | N-[(1S)-1-phenylethyl]-5-(2,2,2-tri...)
Show SMILES C[C@H](NC(=O)c1ccc(s1)C(=O)C(F)(F)F)c1ccccc1 |r|
Show InChI InChI=1S/C15H12F3NO2S/c1-9(10-5-3-2-4-6-10)19-14(21)12-8-7-11(22-12)13(20)15(16,17)18/h2-9H,1H3,(H,19,21)/t9-/m0/s1
NCI pathway
Reactome pathway
n/an/a 9.40E+3n/an/an/an/an/an/a
IRBM-Merck Research Laboratories Rome
Curated by ChEMBL
Assay Description
Inhibition of HDAC3 (unknown origin)
Bioorg Med Chem Lett 18: 6083-7 (2008)
Article DOI: 10.1016/j.bmcl.2008.09.076
BindingDB Entry DOI: 10.7270/Q2TD9X6G
Histone deacetylase 1
(Homo sapiens (Human))
BDBM25159
(CHEMBL462208 | N-[(1S)-1-phenylethyl]-5-(2,2,2-tri...)
Show SMILES C[C@H](NC(=O)c1ccc(s1)C(=O)C(F)(F)F)c1ccccc1 |r|
Show InChI InChI=1S/C15H12F3NO2S/c1-9(10-5-3-2-4-6-10)19-14(21)12-8-7-11(22-12)13(20)15(16,17)18/h2-9H,1H3,(H,19,21)/t9-/m0/s1
NCI pathway
Reactome pathway
n/an/a 5.00E+3n/an/an/an/an/an/a
IRBM-Merck Research Laboratories Rome
Curated by ChEMBL
Assay Description
Inhibition of HDAC1 purified from HEK293 cells by western blot
Bioorg Med Chem Lett 18: 6078-82 (2008)
Article DOI: 10.1016/j.bmcl.2008.10.041
BindingDB Entry DOI: 10.7270/Q2V987XH
Histone deacetylase 3
(Homo sapiens (Human))
BDBM25159
(CHEMBL462208 | N-[(1S)-1-phenylethyl]-5-(2,2,2-tri...)
Show SMILES C[C@H](NC(=O)c1ccc(s1)C(=O)C(F)(F)F)c1ccccc1 |r|
Show InChI InChI=1S/C15H12F3NO2S/c1-9(10-5-3-2-4-6-10)19-14(21)12-8-7-11(22-12)13(20)15(16,17)18/h2-9H,1H3,(H,19,21)/t9-/m0/s1
NCI pathway
Reactome pathway
n/an/a 9.40E+3n/an/an/an/an/an/a
IRBM-Merck Research Laboratories Rome
Curated by ChEMBL
Assay Description
Inhibition of HDAC3 purified from HEK293 cells by western blot
Bioorg Med Chem Lett 18: 6078-82 (2008)
Article DOI: 10.1016/j.bmcl.2008.10.041
BindingDB Entry DOI: 10.7270/Q2V987XH
Histone deacetylase 4
(Homo sapiens (Human))
BDBM25159
(CHEMBL462208 | N-[(1S)-1-phenylethyl]-5-(2,2,2-tri...)
Show SMILES C[C@H](NC(=O)c1ccc(s1)C(=O)C(F)(F)F)c1ccccc1 |r|
Show InChI InChI=1S/C15H12F3NO2S/c1-9(10-5-3-2-4-6-10)19-14(21)12-8-7-11(22-12)13(20)15(16,17)18/h2-9H,1H3,(H,19,21)/t9-/m0/s1
n/an/a 170n/an/an/an/an/an/a
IRBM-Merck Research Laboratories Rome
Curated by ChEMBL
Assay Description
Inhibition of His-tagged HDAC4 catalytic domain (unknown origin) expressed in Escherichia coli
Bioorg Med Chem Lett 18: 6083-7 (2008)
Article DOI: 10.1016/j.bmcl.2008.09.076
BindingDB Entry DOI: 10.7270/Q2TD9X6G