BDBM251592 US9453031, 15
SMILES: CC(C)(c1nc(nc2N3CCOC[C@@H]3COc12)-c1cccc2[nH]ccc12)S(C)(=O)=O
InChI Key:
Data: 3 IC50
Activity Spreadsheet -- Enzyme Inhibition Constant Data from BindingDB
Found 3 hits for monomerid = 251592
Trg + Lig
Ki
nM
ΔG°
kcal/mole
IC50
nM
Kd
nM
EC50/IC50
nM
koff
s-1
kon
M-1s-1
pHTemp
°C
p110α/p85α
(Homo sapiens (Human))
BDBM251592
(US9453031, 15)
Show SMILES CC(C)(c1nc(nc2N3CCOC[C@@H]3COc12)-c1cccc2[nH]ccc12)S(C)(=O)=O |r|
US Patent
n/an/a 1.10E+3n/an/an/an/a7.525
Fundación Centro Nacional de Investigaciones Oncológicas Carlos III
US Patent
Assay Description
The kinase activity was measured by using the commercial ADP Hunter Plus assay available from DiscoveRx (#33-016), which is a homogeneous assay to me...
US Patent US9453031 (2016)
BindingDB Entry DOI: 10.7270/Q27H1HH8
DNA-dependent protein kinase catalytic subunit
(Homo sapiens (Human))
BDBM251592
(US9453031, 15)
Show SMILES CC(C)(c1nc(nc2N3CCOC[C@@H]3COc12)-c1cccc2[nH]ccc12)S(C)(=O)=O |r|
US Patent
n/an/a 2.86E+3n/an/an/an/a7.537
Fundación Centro Nacional de Investigaciones Oncológicas Carlos III
US Patent
Assay Description
The kinase activity was measured by using the commercial ADP Hunter Plus assay available from DiscoveRx (#90-0083), which is a homogeneous assay to m...
US Patent US9453031 (2016)
BindingDB Entry DOI: 10.7270/Q27H1HH8
Serine/threonine-protein kinase mTOR
(Homo sapiens (Human))
BDBM251592
(US9453031, 15)
Show SMILES CC(C)(c1nc(nc2N3CCOC[C@@H]3COc12)-c1cccc2[nH]ccc12)S(C)(=O)=O |r|
US Patent
n/an/a 851n/an/an/an/a7.525
Fundación Centro Nacional de Investigaciones Oncológicas Carlos III
US Patent
Assay Description
The enzymatic mTOR activity was measured using a LanthaScreen kinase activity assay (Invitrogen). The enzyme was purchased from Invitrogen (PV4754), ...
US Patent US9453031 (2016)
BindingDB Entry DOI: 10.7270/Q27H1HH8