null
SMILES: CN(Cc1ccccc1)C(=O)c1ccc(s1)C(O)C(F)(F)F
InChI Key: InChIKey=KHJHLUOUXKNRGE-UHFFFAOYSA-N
Activity Spreadsheet -- Enzyme Inhibition Constant Data from BindingDB
Found 5 hits for monomerid = 25165
Trg + Lig
Ki
nM
ΔG°
kcal/mole
IC50
nM
Kd
nM
EC50/IC50
nM
koff
s-1
kon
M-1s-1
pHTemp
°C
Histone deacetylase 1
(Homo sapiens (Human))
BDBM25165
(N-benzyl-N-methyl-5-(2,2,2-trifluoro-1-hydroxyethy...)
Show SMILES CN(Cc1ccccc1)C(=O)c1ccc(s1)C(O)C(F)(F)F
Show InChI InChI=1S/C15H14F3NO2S/c1-19(9-10-5-3-2-4-6-10)14(21)12-8-7-11(22-12)13(20)15(16,17)18/h2-8,13,20H,9H2,1H3
NCI pathway
Reactome pathway
n/an/an/an/an/an/an/a8.037
IRBM/Merck
Assay Description
The Fluor-de-Lys HDAC activity assay kit (Biomol) was used. Purified recombinant HDAC enzyme was incubated with Fluor-de-Lys substrate in the presenc...
Bioorg Med Chem Lett 18: 3456-61 (2008)
Article DOI: 10.1016/j.bmcl.2008.02.026
BindingDB Entry DOI: 10.7270/Q2MS3R28
Histone deacetylase 3
(Homo sapiens (Human))
BDBM25165
(N-benzyl-N-methyl-5-(2,2,2-trifluoro-1-hydroxyethy...)
Show SMILES CN(Cc1ccccc1)C(=O)c1ccc(s1)C(O)C(F)(F)F
Show InChI InChI=1S/C15H14F3NO2S/c1-19(9-10-5-3-2-4-6-10)14(21)12-8-7-11(22-12)13(20)15(16,17)18/h2-8,13,20H,9H2,1H3
NCI pathway
Reactome pathway
n/an/an/an/an/an/an/an/a25
IRBM/Merck
Assay Description
The Fluor-de-Lys HDAC activity assay kit (Biomol) was used. Purified recombinant HDAC enzyme was incubated with Fluor-de-Lys substrate in the presenc...
Bioorg Med Chem Lett 18: 3456-61 (2008)
Article DOI: 10.1016/j.bmcl.2008.02.026
BindingDB Entry DOI: 10.7270/Q2MS3R28
Histone deacetylase 6
(Homo sapiens (Human))
BDBM25165
(N-benzyl-N-methyl-5-(2,2,2-trifluoro-1-hydroxyethy...)
Show SMILES CN(Cc1ccccc1)C(=O)c1ccc(s1)C(O)C(F)(F)F
Show InChI InChI=1S/C15H14F3NO2S/c1-19(9-10-5-3-2-4-6-10)14(21)12-8-7-11(22-12)13(20)15(16,17)18/h2-8,13,20H,9H2,1H3
NCI pathway
Reactome pathway
n/an/an/an/an/an/an/an/a25
IRBM/Merck
Assay Description
The Fluor-de-Lys HDAC activity assay kit (Biomol) was used. Purified recombinant HDAC enzyme was incubated with Fluor-de-Lys substrate in the presenc...
Bioorg Med Chem Lett 18: 3456-61 (2008)
Article DOI: 10.1016/j.bmcl.2008.02.026
BindingDB Entry DOI: 10.7270/Q2MS3R28
Histone deacetylase 4
(Homo sapiens (Human))
BDBM25165
(N-benzyl-N-methyl-5-(2,2,2-trifluoro-1-hydroxyethy...)
Show SMILES CN(Cc1ccccc1)C(=O)c1ccc(s1)C(O)C(F)(F)F
Show InChI InChI=1S/C15H14F3NO2S/c1-19(9-10-5-3-2-4-6-10)14(21)12-8-7-11(22-12)13(20)15(16,17)18/h2-8,13,20H,9H2,1H3
n/an/an/an/an/an/an/an/a25
IRBM/Merck
Assay Description
The Fluor-de-Lys HDAC activity assay kit (Biomol) was used. Purified recombinant HDAC enzyme was incubated with Fluor-de-Lys substrate in the presenc...
Bioorg Med Chem Lett 18: 3456-61 (2008)
Article DOI: 10.1016/j.bmcl.2008.02.026
BindingDB Entry DOI: 10.7270/Q2MS3R28
Histone deacetylase 4 [653-1084,H976Y]
(Homo sapiens (Human))
BDBM25165
(N-benzyl-N-methyl-5-(2,2,2-trifluoro-1-hydroxyethy...)
Show SMILES CN(Cc1ccccc1)C(=O)c1ccc(s1)C(O)C(F)(F)F
Show InChI InChI=1S/C15H14F3NO2S/c1-19(9-10-5-3-2-4-6-10)14(21)12-8-7-11(22-12)13(20)15(16,17)18/h2-8,13,20H,9H2,1H3
n/an/an/an/an/an/an/an/a25
IRBM/Merck
Assay Description
The Fluor-de-Lys HDAC activity assay kit (Biomol) was used. Purified recombinant HDAC enzyme was incubated with Fluor-de-Lys substrate in the presenc...
Bioorg Med Chem Lett 18: 3456-61 (2008)
Article DOI: 10.1016/j.bmcl.2008.02.026
BindingDB Entry DOI: 10.7270/Q2MS3R28