BDBM251673 US10100018, Example 9::US9464060, 9
SMILES: OC(=O)c1ccc(CN(CCC2CC2)C(=O)c2ccc(Oc3ccccc3F)cc2)cc1
InChI Key: InChIKey=ZGDVUUZJQBVBNQ-UHFFFAOYSA-N
Data: 2 IC50
Activity Spreadsheet -- Enzyme Inhibition Constant Data from BindingDB
Found 2 hits for monomerid = 251673
Trg + Lig
Ki
nM
ΔG°
kcal/mole
IC50
nM
Kd
nM
EC50/IC50
nM
koff
s-1
kon
M-1s-1
pHTemp
°C
Lysophosphatidic acid receptor 1
(Homo sapiens (Human))
BDBM251673
(US10100018, Example 9 | US9464060, 9)
Show SMILES OC(=O)c1ccc(CN(CCC2CC2)C(=O)c2ccc(Oc3ccccc3F)cc2)cc1
Show InChI InChI=1S/C26H24FNO4/c27-23-3-1-2-4-24(23)32-22-13-11-20(12-14-22)25(29)28(16-15-18-5-6-18)17-19-7-9-21(10-8-19)26(30)31/h1-4,7-14,18H,5-6,15-17H2,(H,30,31)
US Patent
n/an/a 15n/an/an/an/an/a25
Takeda Pharmaceutical Company Limited
US Patent
Assay Description
Engagement of the LPA1 receptor by its ligand, oleoyl-L-α-lysophosphatidic acid (LPA), leads to the release of intracellular stores of calcium i...
US Patent US10100018 (2018)
BindingDB Entry DOI: 10.7270/Q2PR7Z0N
Lysophosphatidic acid receptor 5 (LPA5)
(Homo sapiens (Human))
BDBM251673
(US10100018, Example 9 | US9464060, 9)
Show SMILES OC(=O)c1ccc(CN(CCC2CC2)C(=O)c2ccc(Oc3ccccc3F)cc2)cc1
Show InChI InChI=1S/C26H24FNO4/c27-23-3-1-2-4-24(23)32-22-13-11-20(12-14-22)25(29)28(16-15-18-5-6-18)17-19-7-9-21(10-8-19)26(30)31/h1-4,7-14,18H,5-6,15-17H2,(H,30,31)
US Patent
n/an/a 15n/an/an/an/an/a37
Takeda Pharmaceutical Company Limited
US Patent
Assay Description
Engagement of the LPA5 receptor by its ligand, oleoyl-L-α-lysophosphatidic acid (LPA), leads to the release of intracellular stores of calcium into ...
US Patent US9464060 (2016)
BindingDB Entry DOI: 10.7270/Q23R0RT0