BDBM251678 US10100018, Example 14::US9464060, 14
SMILES: COc1ccc(CN(Cc2ccc(cc2)C(O)=O)C(=O)c2ccc(Oc3ccccc3F)cc2)cc1
InChI Key: InChIKey=JAYQKBXYZDGMIP-UHFFFAOYSA-N
Data: 4 IC50
Activity Spreadsheet -- Enzyme Inhibition Constant Data from BindingDB
Found 4 hits for monomerid = 251678
Trg + Lig
Ki
nM
ΔG°
kcal/mole
IC50
nM
Kd
nM
EC50/IC50
nM
koff
s-1
kon
M-1s-1
pHTemp
°C
Lysophosphatidic acid receptor 5 (LPA5)
(Homo sapiens (Human))
BDBM251678
(US10100018, Example 14 | US9464060, 14)
Show SMILES COc1ccc(CN(Cc2ccc(cc2)C(O)=O)C(=O)c2ccc(Oc3ccccc3F)cc2)cc1
Show InChI InChI=1S/C29H24FNO5/c1-35-24-14-8-21(9-15-24)19-31(18-20-6-10-23(11-7-20)29(33)34)28(32)22-12-16-25(17-13-22)36-27-5-3-2-4-26(27)30/h2-17H,18-19H2,1H3,(H,33,34)
US Patent
n/an/a 2n/an/an/an/an/a37
Takeda Pharmaceutical Company Limited
US Patent
Assay Description
Engagement of the LPA5 receptor by its ligand, oleoyl-L-α-lysophosphatidic acid (LPA), leads to the release of intracellular stores of calcium into ...
US Patent US9464060 (2016)
BindingDB Entry DOI: 10.7270/Q23R0RT0
Lysophosphatidic acid receptor 1
(Homo sapiens (Human))
BDBM251678
(US10100018, Example 14 | US9464060, 14)
Show SMILES COc1ccc(CN(Cc2ccc(cc2)C(O)=O)C(=O)c2ccc(Oc3ccccc3F)cc2)cc1
Show InChI InChI=1S/C29H24FNO5/c1-35-24-14-8-21(9-15-24)19-31(18-20-6-10-23(11-7-20)29(33)34)28(32)22-12-16-25(17-13-22)36-27-5-3-2-4-26(27)30/h2-17H,18-19H2,1H3,(H,33,34)
US Patent
n/an/a 2n/an/an/an/an/a25
Takeda Pharmaceutical Company Limited
US Patent
Assay Description
Engagement of the LPA1 receptor by its ligand, oleoyl-L-α-lysophosphatidic acid (LPA), leads to the release of intracellular stores of calcium i...
US Patent US10100018 (2018)
BindingDB Entry DOI: 10.7270/Q2PR7Z0N
Lysophosphatidic acid receptor 1
(Homo sapiens (Human))
BDBM251678
(US10100018, Example 14 | US9464060, 14)
Show SMILES COc1ccc(CN(Cc2ccc(cc2)C(O)=O)C(=O)c2ccc(Oc3ccccc3F)cc2)cc1
Show InChI InChI=1S/C29H24FNO5/c1-35-24-14-8-21(9-15-24)19-31(18-20-6-10-23(11-7-20)29(33)34)28(32)22-12-16-25(17-13-22)36-27-5-3-2-4-26(27)30/h2-17H,18-19H2,1H3,(H,33,34)
US Patent
n/an/a 2n/an/an/an/an/a25
Takeda Pharmaceutical Company Limited
US Patent
Assay Description
Engagement of the LPA1 receptor by its ligand, oleoyl-L-α-lysophosphatidic acid (LPA), leads to the release of intracellular stores of calcium i...
US Patent US10100018 (2018)
BindingDB Entry DOI: 10.7270/Q2PR7Z0N
Lysophosphatidic acid receptor 1
(Homo sapiens (Human))
BDBM251678
(US10100018, Example 14 | US9464060, 14)
Show SMILES COc1ccc(CN(Cc2ccc(cc2)C(O)=O)C(=O)c2ccc(Oc3ccccc3F)cc2)cc1
Show InChI InChI=1S/C29H24FNO5/c1-35-24-14-8-21(9-15-24)19-31(18-20-6-10-23(11-7-20)29(33)34)28(32)22-12-16-25(17-13-22)36-27-5-3-2-4-26(27)30/h2-17H,18-19H2,1H3,(H,33,34)
US Patent
n/an/a 2n/an/an/an/an/a37
Takeda Pharmaceutical Company Limited
US Patent
Assay Description
Engagement of the LPA1 receptor by its ligand, oleoyl-L-α-lysophosphatidic acid (LPA), leads to the release of intracellular stores of calcium into ...
US Patent US9464060 (2016)
BindingDB Entry DOI: 10.7270/Q23R0RT0