BDBM25173 [5-(2,3-dihydro-1H-indol-1-ylcarbonyl)thiophen-2-yl](dihydroxyboranyl)methanone::thiophene derivative, 16h
SMILES: OB(O)C(=O)c1ccc(s1)C(=O)N1CCc2ccccc12
InChI Key: InChIKey=AEMKXZKAFWAYEI-UHFFFAOYSA-N
Data: 5 Other
Activity Spreadsheet -- Enzyme Inhibition Constant Data from BindingDB
Found 5 hits for monomerid = 25173
Trg + Lig
Ki
nM
ΔG°
kcal/mole
IC50
nM
Kd
nM
EC50/IC50
nM
koff
s-1
kon
M-1s-1
pHTemp
°C
Histone deacetylase 6
(Homo sapiens (Human))
BDBM25173
([5-(2,3-dihydro-1H-indol-1-ylcarbonyl)thiophen-2-y...)
Show SMILES OB(O)C(=O)c1ccc(s1)C(=O)N1CCc2ccccc12
Show InChI InChI=1S/C14H12BNO4S/c17-13(15(19)20)11-5-6-12(21-11)14(18)16-8-7-9-3-1-2-4-10(9)16/h1-6,19-20H,7-8H2
NCI pathway
Reactome pathway
n/an/an/an/an/an/an/an/a25
IRBM/Merck
Assay Description
The Fluor-de-Lys HDAC activity assay kit (Biomol) was used. Purified recombinant HDAC enzyme was incubated with Fluor-de-Lys substrate in the presenc...
Bioorg Med Chem Lett 18: 3456-61 (2008)
Article DOI: 10.1016/j.bmcl.2008.02.026
BindingDB Entry DOI: 10.7270/Q2MS3R28
Histone deacetylase 1
(Homo sapiens (Human))
BDBM25173
([5-(2,3-dihydro-1H-indol-1-ylcarbonyl)thiophen-2-y...)
Show SMILES OB(O)C(=O)c1ccc(s1)C(=O)N1CCc2ccccc12
Show InChI InChI=1S/C14H12BNO4S/c17-13(15(19)20)11-5-6-12(21-11)14(18)16-8-7-9-3-1-2-4-10(9)16/h1-6,19-20H,7-8H2
NCI pathway
Reactome pathway
n/an/an/an/an/an/an/a8.037
IRBM/Merck
Assay Description
The Fluor-de-Lys HDAC activity assay kit (Biomol) was used. Purified recombinant HDAC enzyme was incubated with Fluor-de-Lys substrate in the presenc...
Bioorg Med Chem Lett 18: 3456-61 (2008)
Article DOI: 10.1016/j.bmcl.2008.02.026
BindingDB Entry DOI: 10.7270/Q2MS3R28
Histone deacetylase 4
(Homo sapiens (Human))
BDBM25173
([5-(2,3-dihydro-1H-indol-1-ylcarbonyl)thiophen-2-y...)
Show SMILES OB(O)C(=O)c1ccc(s1)C(=O)N1CCc2ccccc12
Show InChI InChI=1S/C14H12BNO4S/c17-13(15(19)20)11-5-6-12(21-11)14(18)16-8-7-9-3-1-2-4-10(9)16/h1-6,19-20H,7-8H2
n/an/an/an/an/an/an/an/a25
IRBM/Merck
Assay Description
The Fluor-de-Lys HDAC activity assay kit (Biomol) was used. Purified recombinant HDAC enzyme was incubated with Fluor-de-Lys substrate in the presenc...
Bioorg Med Chem Lett 18: 3456-61 (2008)
Article DOI: 10.1016/j.bmcl.2008.02.026
BindingDB Entry DOI: 10.7270/Q2MS3R28
Histone deacetylase 4 [653-1084,H976Y]
(Homo sapiens (Human))
BDBM25173
([5-(2,3-dihydro-1H-indol-1-ylcarbonyl)thiophen-2-y...)
Show SMILES OB(O)C(=O)c1ccc(s1)C(=O)N1CCc2ccccc12
Show InChI InChI=1S/C14H12BNO4S/c17-13(15(19)20)11-5-6-12(21-11)14(18)16-8-7-9-3-1-2-4-10(9)16/h1-6,19-20H,7-8H2
n/an/an/an/an/an/an/an/a25
IRBM/Merck
Assay Description
The Fluor-de-Lys HDAC activity assay kit (Biomol) was used. Purified recombinant HDAC enzyme was incubated with Fluor-de-Lys substrate in the presenc...
Bioorg Med Chem Lett 18: 3456-61 (2008)
Article DOI: 10.1016/j.bmcl.2008.02.026
BindingDB Entry DOI: 10.7270/Q2MS3R28
Histone deacetylase 3
(Homo sapiens (Human))
BDBM25173
([5-(2,3-dihydro-1H-indol-1-ylcarbonyl)thiophen-2-y...)
Show SMILES OB(O)C(=O)c1ccc(s1)C(=O)N1CCc2ccccc12
Show InChI InChI=1S/C14H12BNO4S/c17-13(15(19)20)11-5-6-12(21-11)14(18)16-8-7-9-3-1-2-4-10(9)16/h1-6,19-20H,7-8H2
NCI pathway
Reactome pathway
n/an/an/an/an/an/an/an/a25
IRBM/Merck
Assay Description
The Fluor-de-Lys HDAC activity assay kit (Biomol) was used. Purified recombinant HDAC enzyme was incubated with Fluor-de-Lys substrate in the presenc...
Bioorg Med Chem Lett 18: 3456-61 (2008)
Article DOI: 10.1016/j.bmcl.2008.02.026
BindingDB Entry DOI: 10.7270/Q2MS3R28