BDBM251927 US10065961, Compound 29::US10683295, Compound 29::US10941151, Compound 29::US9475814, 29
SMILES: C[C@H]1N(CCn2c1nnc2-c1cccc(C)n1)C(=O)c1ccc(cc1)-c1ccccc1
InChI Key: InChIKey=XPXDUFBCXYPOFW-GOSISDBHSA-N
Data: 4 KI  5 IC50
Activity Spreadsheet -- Enzyme Inhibition Constant Data from BindingDB
Found 9 hits for monomerid = 251927
Trg + Lig
Ki
nM
ΔG°
kcal/mole
IC50
nM
Kd
nM
EC50/IC50
nM
koff
s-1
kon
M-1s-1
pHTemp
°C
Neuromedin-K receptor
(Homo sapiens (Human))
BDBM251927
(US10065961, Compound 29 | US10683295, Compound 29 ...)
Show SMILES C[C@H]1N(CCn2c1nnc2-c1cccc(C)n1)C(=O)c1ccc(cc1)-c1ccccc1 |r|
Show InChI InChI=1S/C25H23N5O/c1-17-7-6-10-22(26-17)24-28-27-23-18(2)29(15-16-30(23)24)25(31)21-13-11-20(12-14-21)19-8-4-3-5-9-19/h3-14,18H,15-16H2,1-2H3/t18-/m1/s1
Reactome pathway
US Patent
23n/an/an/an/an/an/an/an/a
Ogeda SA.
US Patent
Assay Description
The antagonist activity of compounds of the invention is measured following pre-incubation (3 minutes) of the compound with the cells, followed by ad...
US Patent US10065961 (2018)
BindingDB Entry DOI: 10.7270/Q2MW2K4R
Neurokinin 3 receptor
(Homo sapiens (Human))
BDBM251927
(US10065961, Compound 29 | US10683295, Compound 29 ...)
Show SMILES C[C@H]1N(CCn2c1nnc2-c1cccc(C)n1)C(=O)c1ccc(cc1)-c1ccccc1 |r|
Show InChI InChI=1S/C25H23N5O/c1-17-7-6-10-22(26-17)24-28-27-23-18(2)29(15-16-30(23)24)25(31)21-13-11-20(12-14-21)19-8-4-3-5-9-19/h3-14,18H,15-16H2,1-2H3/t18-/m1/s1
Reactome pathway
US Patent
23n/an/an/an/an/an/an/an/a
Ogeda SA
US Patent
Assay Description
NK3: The ability of compounds of the invention to inhibit the binding of the NK-3 receptor selective antagonist 3H-SB222200 was assessed by an in vit...
US Patent US10683295 (2020)
Neuromedin-K receptor
(Homo sapiens (Human))
BDBM251927
(US10065961, Compound 29 | US10683295, Compound 29 ...)
Show SMILES C[C@H]1N(CCn2c1nnc2-c1cccc(C)n1)C(=O)c1ccc(cc1)-c1ccccc1 |r|
Show InChI InChI=1S/C25H23N5O/c1-17-7-6-10-22(26-17)24-28-27-23-18(2)29(15-16-30(23)24)25(31)21-13-11-20(12-14-21)19-8-4-3-5-9-19/h3-14,18H,15-16H2,1-2H3/t18-/m1/s1
Reactome pathway
US Patent
23n/an/an/an/an/an/a7.4n/a
Euroscreen S.A.
US Patent
Assay Description
The ability of compounds of the invention to inhibit the binding of the NK-3 receptor selective antagonist 3H-SB222200 was assessed by an in vitro ra...
US Patent US9475814 (2016)
BindingDB Entry DOI: 10.7270/Q2B8571Q
Neurokinin 3 receptor
(Homo sapiens (Human))
BDBM251927
(US10065961, Compound 29 | US10683295, Compound 29 ...)
Show SMILES C[C@H]1N(CCn2c1nnc2-c1cccc(C)n1)C(=O)c1ccc(cc1)-c1ccccc1 |r|
Show InChI InChI=1S/C25H23N5O/c1-17-7-6-10-22(26-17)24-28-27-23-18(2)29(15-16-30(23)24)25(31)21-13-11-20(12-14-21)19-8-4-3-5-9-19/h3-14,18H,15-16H2,1-2H3/t18-/m1/s1
Reactome pathway
US Patent
23n/an/an/an/an/an/an/an/a
Ogeda SA
US Patent
Assay Description
NK3: The ability of compounds of the invention to inhibit the binding of the NK-3 receptor selective antagonist 3H-SB222200 was assessed by an in vit...
US Patent US10941151 (2021)
Melanin-concentrating hormone receptor 2/HERG
(Homo sapiens (Human))
BDBM251927
(US10065961, Compound 29 | US10683295, Compound 29 ...)
Show SMILES C[C@H]1N(CCn2c1nnc2-c1cccc(C)n1)C(=O)c1ccc(cc1)-c1ccccc1 |r|
Show InChI InChI=1S/C25H23N5O/c1-17-7-6-10-22(26-17)24-28-27-23-18(2)29(15-16-30(23)24)25(31)21-13-11-20(12-14-21)19-8-4-3-5-9-19/h3-14,18H,15-16H2,1-2H3/t18-/m1/s1
Reactome pathway
US Patent
n/an/a 2.50E+4n/an/an/an/an/an/a
Ogeda SA
US Patent
Assay Description
hERG: The hERG inhibition study aims at quantifying the in vitro effects of compounds of the invention on the potassium-selective IKr current generat...
US Patent US10683295 (2020)
Neuromedin-K receptor
(Homo sapiens (Human))
BDBM251927
(US10065961, Compound 29 | US10683295, Compound 29 ...)
Show SMILES C[C@H]1N(CCn2c1nnc2-c1cccc(C)n1)C(=O)c1ccc(cc1)-c1ccccc1 |r|
Show InChI InChI=1S/C25H23N5O/c1-17-7-6-10-22(26-17)24-28-27-23-18(2)29(15-16-30(23)24)25(31)21-13-11-20(12-14-21)19-8-4-3-5-9-19/h3-14,18H,15-16H2,1-2H3/t18-/m1/s1
Reactome pathway
US Patent
n/an/a 18n/an/an/an/an/an/a
Ogeda SA.
US Patent
Assay Description
The antagonist activity of compounds of the invention is measured following pre-incubation (3 minutes) of the compound with the cells, followed by ad...
US Patent US10065961 (2018)
BindingDB Entry DOI: 10.7270/Q2MW2K4R
Potassium voltage-gated channel subfamily H member 2
(Homo sapiens (Human))
BDBM251927
(US10065961, Compound 29 | US10683295, Compound 29 ...)
Show SMILES C[C@H]1N(CCn2c1nnc2-c1cccc(C)n1)C(=O)c1ccc(cc1)-c1ccccc1 |r|
Show InChI InChI=1S/C25H23N5O/c1-17-7-6-10-22(26-17)24-28-27-23-18(2)29(15-16-30(23)24)25(31)21-13-11-20(12-14-21)19-8-4-3-5-9-19/h3-14,18H,15-16H2,1-2H3/t18-/m1/s1
Reactome pathway
US Patent
n/an/a 2.50E+4n/an/an/an/an/an/a
Euroscreen S.A.
US Patent
Assay Description
The hERG inhibition study aims at quantifying the in vitro effects of compounds of the invention on the potassium-selective IKf current generated in ...
US Patent US9475814 (2016)
BindingDB Entry DOI: 10.7270/Q2B8571Q
Neuromedin-K receptor
(Homo sapiens (Human))
BDBM251927
(US10065961, Compound 29 | US10683295, Compound 29 ...)
Show SMILES C[C@H]1N(CCn2c1nnc2-c1cccc(C)n1)C(=O)c1ccc(cc1)-c1ccccc1 |r|
Show InChI InChI=1S/C25H23N5O/c1-17-7-6-10-22(26-17)24-28-27-23-18(2)29(15-16-30(23)24)25(31)21-13-11-20(12-14-21)19-8-4-3-5-9-19/h3-14,18H,15-16H2,1-2H3/t18-/m1/s1
Reactome pathway
US Patent
n/an/a 18n/an/an/an/an/an/a
Euroscreen S.A.
US Patent
Assay Description
Changes in intracellular calcium levels are a recognized indicator of G protein-coupled receptor activity. The efficacy of compounds of the invention...
US Patent US9475814 (2016)
BindingDB Entry DOI: 10.7270/Q2B8571Q
Transcriptional regulator ERG
(Homo sapiens (Human))
BDBM251927
(US10065961, Compound 29 | US10683295, Compound 29 ...)
Show SMILES C[C@H]1N(CCn2c1nnc2-c1cccc(C)n1)C(=O)c1ccc(cc1)-c1ccccc1 |r|
Show InChI InChI=1S/C25H23N5O/c1-17-7-6-10-22(26-17)24-28-27-23-18(2)29(15-16-30(23)24)25(31)21-13-11-20(12-14-21)19-8-4-3-5-9-19/h3-14,18H,15-16H2,1-2H3/t18-/m1/s1
US Patent
n/an/a 2.50E+4n/an/an/an/an/an/a
Ogeda SA.
US Patent
Assay Description
The human Ether-a-go-go Related Gene (hERG) encodes the inward rectifying voltage gated potassium channel in the heart (IKr) which is involved in car...
US Patent US10065961 (2018)
BindingDB Entry DOI: 10.7270/Q2MW2K4R