BDBM251936 US9458110, 8
SMILES: COC(=O)c1cccc(CNC(=O)c2ccc(-c3cn[nH]c3)c(OC)c2)c1
InChI Key: InChIKey=OMQBPULZTUQWCQ-UHFFFAOYSA-N
Data: 2 IC50
Activity Spreadsheet -- Enzyme Inhibition Constant Data from BindingDB
Found 2 hits for monomerid = 251936
Trg + Lig
Ki
nM
ΔG°
kcal/mole
IC50
nM
Kd
nM
EC50/IC50
nM
koff
s-1
kon
M-1s-1
pHTemp
°C
Rho-associated protein kinase 2
(Homo sapiens (Human))
BDBM251936
(US9458110, 8)
Show SMILES COC(=O)c1cccc(CNC(=O)c2ccc(-c3cn[nH]c3)c(OC)c2)c1
Show InChI InChI=1S/C20H19N3O4/c1-26-18-9-14(6-7-17(18)16-11-22-23-12-16)19(24)21-10-13-4-3-5-15(8-13)20(25)27-2/h3-9,11-12H,10H2,1-2H3,(H,21,24)(H,22,23)
US Patent
n/an/a 0.850n/an/an/an/a7.5n/a
Bristol-Myers Squibb Company
US Patent
Assay Description
The effectiveness of compounds of the present invention as ROCK inhibitors can be determined in a 30 μL assay containing 20 mM HEPES, pH 7.5, 20...
US Patent US9458110 (2016)
BindingDB Entry DOI: 10.7270/Q22V2F2W
Rho-associated protein kinase 1
(Homo sapiens (Human))
BDBM251936
(US9458110, 8)
Show SMILES COC(=O)c1cccc(CNC(=O)c2ccc(-c3cn[nH]c3)c(OC)c2)c1
Show InChI InChI=1S/C20H19N3O4/c1-26-18-9-14(6-7-17(18)16-11-22-23-12-16)19(24)21-10-13-4-3-5-15(8-13)20(25)27-2/h3-9,11-12H,10H2,1-2H3,(H,21,24)(H,22,23)
NCI pathway
Reactome pathway
US Patent
n/an/a 2.63n/an/an/an/a7.5n/a
Bristol-Myers Squibb Company
US Patent
Assay Description
The effectiveness of compounds of the present invention as ROCK inhibitors can be determined in a 30 μL assay containing 20 mM HEPES, pH 7.5, 20...
US Patent US9458110 (2016)
BindingDB Entry DOI: 10.7270/Q22V2F2W