BDBM252098 US9458110, 169::US9458110, 178::US9458110, 179
SMILES: COc1cc(ccc1-c1cn[nH]c1)C(=O)NC(CCN(C)C)c1ccccc1
InChI Key:
Data: 6 IC50
Activity Spreadsheet -- Enzyme Inhibition Constant Data from BindingDB
Found 6 hits for monomerid = 252098
Trg + Lig
Ki
nM
ΔG°
kcal/mole
IC50
nM
Kd
nM
EC50/IC50
nM
koff
s-1
kon
M-1s-1
pHTemp
°C
Rho-associated protein kinase 1
(Homo sapiens (Human))
BDBM252098
(US9458110, 169 | US9458110, 178 | US9458110, 179)
Show SMILES COc1cc(ccc1-c1cn[nH]c1)C(=O)NC(CCN(C)C)c1ccccc1
NCI pathway
Reactome pathway
US Patent
n/an/a 4.70n/an/an/an/a7.5n/a
Bristol-Myers Squibb Company
US Patent
Assay Description
The effectiveness of compounds of the present invention as ROCK inhibitors can be determined in a 30 μL assay containing 20 mM HEPES, pH 7.5, 20...
US Patent US9458110 (2016)
BindingDB Entry DOI: 10.7270/Q22V2F2W
Rho-associated protein kinase 1
(Homo sapiens (Human))
BDBM252098
(US9458110, 169 | US9458110, 178 | US9458110, 179)
Show SMILES COc1cc(ccc1-c1cn[nH]c1)C(=O)NC(CCN(C)C)c1ccccc1
NCI pathway
Reactome pathway
US Patent
n/an/a 94.2n/an/an/an/a7.5n/a
Bristol-Myers Squibb Company
US Patent
Assay Description
The effectiveness of compounds of the present invention as ROCK inhibitors can be determined in a 30 μL assay containing 20 mM HEPES, pH 7.5, 20...
US Patent US9458110 (2016)
BindingDB Entry DOI: 10.7270/Q22V2F2W
Rho-associated protein kinase 2
(Homo sapiens (Human))
BDBM252098
(US9458110, 169 | US9458110, 178 | US9458110, 179)
Show SMILES COc1cc(ccc1-c1cn[nH]c1)C(=O)NC(CCN(C)C)c1ccccc1
US Patent
n/an/a 7.75n/an/an/an/a7.5n/a
Bristol-Myers Squibb Company
US Patent
Assay Description
The effectiveness of compounds of the present invention as ROCK inhibitors can be determined in a 30 μL assay containing 20 mM HEPES, pH 7.5, 20...
US Patent US9458110 (2016)
BindingDB Entry DOI: 10.7270/Q22V2F2W
Rho-associated protein kinase 2
(Homo sapiens (Human))
BDBM252098
(US9458110, 169 | US9458110, 178 | US9458110, 179)
Show SMILES COc1cc(ccc1-c1cn[nH]c1)C(=O)NC(CCN(C)C)c1ccccc1
US Patent
n/an/a 1.93n/an/an/an/a7.5n/a
Bristol-Myers Squibb Company
US Patent
Assay Description
The effectiveness of compounds of the present invention as ROCK inhibitors can be determined in a 30 μL assay containing 20 mM HEPES, pH 7.5, 20...
US Patent US9458110 (2016)
BindingDB Entry DOI: 10.7270/Q22V2F2W
Rho-associated protein kinase 2
(Homo sapiens (Human))
BDBM252098
(US9458110, 169 | US9458110, 178 | US9458110, 179)
Show SMILES COc1cc(ccc1-c1cn[nH]c1)C(=O)NC(CCN(C)C)c1ccccc1
US Patent
n/an/a 31.9n/an/an/an/a7.5n/a
Bristol-Myers Squibb Company
US Patent
Assay Description
The effectiveness of compounds of the present invention as ROCK inhibitors can be determined in a 30 μL assay containing 20 mM HEPES, pH 7.5, 20...
US Patent US9458110 (2016)
BindingDB Entry DOI: 10.7270/Q22V2F2W
Rho-associated protein kinase 1
(Homo sapiens (Human))
BDBM252098
(US9458110, 169 | US9458110, 178 | US9458110, 179)
Show SMILES COc1cc(ccc1-c1cn[nH]c1)C(=O)NC(CCN(C)C)c1ccccc1
NCI pathway
Reactome pathway
US Patent
n/an/a 1.53n/an/an/an/a7.5n/a
Bristol-Myers Squibb Company
US Patent
Assay Description
The effectiveness of compounds of the present invention as ROCK inhibitors can be determined in a 30 μL assay containing 20 mM HEPES, pH 7.5, 20...
US Patent US9458110 (2016)
BindingDB Entry DOI: 10.7270/Q22V2F2W