BDBM252165 US9458110, 237
SMILES: CCNC(=O)c1cccc(CNC(=O)c2ccc(-c3cn[nH]c3)c(OC)c2)c1
InChI Key: InChIKey=JWVWCAKTWBMEPU-UHFFFAOYSA-N
Data: 2 IC50
Activity Spreadsheet -- Enzyme Inhibition Constant Data from BindingDB
Found 2 hits for monomerid = 252165
Trg + Lig
Ki
nM
ΔG°
kcal/mole
IC50
nM
Kd
nM
EC50/IC50
nM
koff
s-1
kon
M-1s-1
pHTemp
°C
Rho-associated protein kinase 2
(Homo sapiens (Human))
BDBM252165
(US9458110, 237)
Show SMILES CCNC(=O)c1cccc(CNC(=O)c2ccc(-c3cn[nH]c3)c(OC)c2)c1
Show InChI InChI=1S/C21H22N4O3/c1-3-22-20(26)15-6-4-5-14(9-15)11-23-21(27)16-7-8-18(19(10-16)28-2)17-12-24-25-13-17/h4-10,12-13H,3,11H2,1-2H3,(H,22,26)(H,23,27)(H,24,25)
US Patent
n/an/a 0.400n/an/an/an/a7.5n/a
Bristol-Myers Squibb Company
US Patent
Assay Description
The effectiveness of compounds of the present invention as ROCK inhibitors can be determined in a 30 μL assay containing 20 mM HEPES, pH 7.5, 20...
US Patent US9458110 (2016)
BindingDB Entry DOI: 10.7270/Q22V2F2W
Rho-associated protein kinase 1
(Homo sapiens (Human))
BDBM252165
(US9458110, 237)
Show SMILES CCNC(=O)c1cccc(CNC(=O)c2ccc(-c3cn[nH]c3)c(OC)c2)c1
Show InChI InChI=1S/C21H22N4O3/c1-3-22-20(26)15-6-4-5-14(9-15)11-23-21(27)16-7-8-18(19(10-16)28-2)17-12-24-25-13-17/h4-10,12-13H,3,11H2,1-2H3,(H,22,26)(H,23,27)(H,24,25)
NCI pathway
Reactome pathway
US Patent
n/an/a 2.39n/an/an/an/a7.5n/a
Bristol-Myers Squibb Company
US Patent
Assay Description
The effectiveness of compounds of the present invention as ROCK inhibitors can be determined in a 30 μL assay containing 20 mM HEPES, pH 7.5, 20...
US Patent US9458110 (2016)
BindingDB Entry DOI: 10.7270/Q22V2F2W