BDBM252169 US9458110, 241
SMILES: CCN1CCCC1CNC(=O)c1cccc(CNC(=O)c2ccc(-c3cn[nH]c3)c(OC)c2)c1
InChI Key:
Data: 2 IC50
Activity Spreadsheet -- Enzyme Inhibition Constant Data from BindingDB
Found 2 hits for monomerid = 252169
Trg + Lig
Ki
nM
ΔG°
kcal/mole
IC50
nM
Kd
nM
EC50/IC50
nM
koff
s-1
kon
M-1s-1
pHTemp
°C
Rho-associated protein kinase 2
(Homo sapiens (Human))
BDBM252169
(US9458110, 241)
Show SMILES CCN1CCCC1CNC(=O)c1cccc(CNC(=O)c2ccc(-c3cn[nH]c3)c(OC)c2)c1
US Patent
n/an/a 0.850n/an/an/an/a7.5n/a
Bristol-Myers Squibb Company
US Patent
Assay Description
The effectiveness of compounds of the present invention as ROCK inhibitors can be determined in a 30 μL assay containing 20 mM HEPES, pH 7.5, 20...
US Patent US9458110 (2016)
BindingDB Entry DOI: 10.7270/Q22V2F2W
Rho-associated protein kinase 1
(Homo sapiens (Human))
BDBM252169
(US9458110, 241)
Show SMILES CCN1CCCC1CNC(=O)c1cccc(CNC(=O)c2ccc(-c3cn[nH]c3)c(OC)c2)c1
NCI pathway
Reactome pathway
US Patent
n/an/a 1.54n/an/an/an/a7.5n/a
Bristol-Myers Squibb Company
US Patent
Assay Description
The effectiveness of compounds of the present invention as ROCK inhibitors can be determined in a 30 μL assay containing 20 mM HEPES, pH 7.5, 20...
US Patent US9458110 (2016)
BindingDB Entry DOI: 10.7270/Q22V2F2W