BDBM252173 US9458110, 245
SMILES: Cc1cc(ccc1-c1cn[nH]c1)C(=O)NCc1cccc(c1)C(=O)NC[C@H]1CCCN1
InChI Key:
Data: 2 IC50
Activity Spreadsheet -- Enzyme Inhibition Constant Data from BindingDB
Found 2 hits for monomerid = 252173
Trg + Lig
Ki
nM
ΔG°
kcal/mole
IC50
nM
Kd
nM
EC50/IC50
nM
koff
s-1
kon
M-1s-1
pHTemp
°C
Rho-associated protein kinase 2
(Homo sapiens (Human))
BDBM252173
(US9458110, 245)
Show SMILES Cc1cc(ccc1-c1cn[nH]c1)C(=O)NCc1cccc(c1)C(=O)NC[C@H]1CCCN1 |r|
US Patent
n/an/a 0.710n/an/an/an/a7.5n/a
Bristol-Myers Squibb Company
US Patent
Assay Description
The effectiveness of compounds of the present invention as ROCK inhibitors can be determined in a 30 μL assay containing 20 mM HEPES, pH 7.5, 20...
US Patent US9458110 (2016)
BindingDB Entry DOI: 10.7270/Q22V2F2W
Rho-associated protein kinase 1
(Homo sapiens (Human))
BDBM252173
(US9458110, 245)
Show SMILES Cc1cc(ccc1-c1cn[nH]c1)C(=O)NCc1cccc(c1)C(=O)NC[C@H]1CCCN1 |r|
NCI pathway
Reactome pathway
US Patent
n/an/a 2.46n/an/an/an/a7.5n/a
Bristol-Myers Squibb Company
US Patent
Assay Description
The effectiveness of compounds of the present invention as ROCK inhibitors can be determined in a 30 μL assay containing 20 mM HEPES, pH 7.5, 20...
US Patent US9458110 (2016)
BindingDB Entry DOI: 10.7270/Q22V2F2W