BDBM252193 US9458110, 265
SMILES: CCNC[C@@H](NC(=O)c1ccc(-c2cn[nH]c2)c(OC)c1)c1c(F)cccc1F
InChI Key:
Data: 2 IC50
Activity Spreadsheet -- Enzyme Inhibition Constant Data from BindingDB
Found 2 hits for monomerid = 252193
Trg + Lig
Ki
nM
ΔG°
kcal/mole
IC50
nM
Kd
nM
EC50/IC50
nM
koff
s-1
kon
M-1s-1
pHTemp
°C
Rho-associated protein kinase 2
(Homo sapiens (Human))
BDBM252193
(US9458110, 265)
Show SMILES CCNC[C@@H](NC(=O)c1ccc(-c2cn[nH]c2)c(OC)c1)c1c(F)cccc1F |r|
US Patent
n/an/a 1.29n/an/an/an/a7.5n/a
Bristol-Myers Squibb Company
US Patent
Assay Description
The effectiveness of compounds of the present invention as ROCK inhibitors can be determined in a 30 μL assay containing 20 mM HEPES, pH 7.5, 20...
US Patent US9458110 (2016)
BindingDB Entry DOI: 10.7270/Q22V2F2W
Rho-associated protein kinase 1
(Homo sapiens (Human))
BDBM252193
(US9458110, 265)
Show SMILES CCNC[C@@H](NC(=O)c1ccc(-c2cn[nH]c2)c(OC)c1)c1c(F)cccc1F |r|
NCI pathway
Reactome pathway
US Patent
n/an/a 2.26n/an/an/an/a7.5n/a
Bristol-Myers Squibb Company
US Patent
Assay Description
The effectiveness of compounds of the present invention as ROCK inhibitors can be determined in a 30 μL assay containing 20 mM HEPES, pH 7.5, 20...
US Patent US9458110 (2016)
BindingDB Entry DOI: 10.7270/Q22V2F2W