BDBM253000 US9469608, 29-9a
SMILES: NCc1ccc(Cl)cc1CNC(=O)[C@@H]1CCCN1C(=O)C1(N)CCc2cccnc12
InChI Key: InChIKey=DIDMYCBKRZYIHV-HXBUSHRASA-N
Data: 1 KI
Activity Spreadsheet -- Enzyme Inhibition Constant Data from BindingDB
Found 1 hit for monomerid = 253000
Trg + Lig
Ki
nM
ΔG°
kcal/mole
IC50
nM
Kd
nM
EC50/IC50
nM
koff
s-1
kon
M-1s-1
pHTemp
°C
Prothrombin
(Homo sapiens (Human))
BDBM253000
(US9469608, 29-9a)
Show SMILES NCc1ccc(Cl)cc1CNC(=O)[C@@H]1CCCN1C(=O)C1(N)CCc2cccnc12 |r|
Show InChI InChI=1S/C22H26ClN5O2/c23-17-6-5-15(12-24)16(11-17)13-27-20(29)18-4-2-10-28(18)21(30)22(25)8-7-14-3-1-9-26-19(14)22/h1,3,5-6,9,11,18H,2,4,7-8,10,12-13,24-25H2,(H,27,29)/t18-,22?/m0/s1
US Patent
30n/an/an/an/an/an/a7.4n/a
Merck Sharp & Dohme Corp.
US Patent
Assay Description
Relevant in vitro assays are referenced in Morrissette, et al., Bioorg. Med. Chem. Lett. 2004, 14, 4161-4164 and described in Lewis, et al. Thromb. R...
US Patent US9469608 (2016)
BindingDB Entry DOI: 10.7270/Q2F18XNQ