BDBM253003 US9469608, 31-7
SMILES: NCc1ccc(Cl)cc1CNC(=O)[C@@H]1CCCN1C(=O)C1(O)CCCc2cnccc12
InChI Key: InChIKey=MGVZEQMHPKOVRP-AJZOCDQUSA-N
Data: 1 KI
Activity Spreadsheet -- Enzyme Inhibition Constant Data from BindingDB
Found 1 hit for monomerid = 253003
Trg + Lig
Ki
nM
ΔG°
kcal/mole
IC50
nM
Kd
nM
EC50/IC50
nM
koff
s-1
kon
M-1s-1
pHTemp
°C
Prothrombin
(Homo sapiens (Human))
BDBM253003
(US9469608, 31-7)
Show SMILES NCc1ccc(Cl)cc1CNC(=O)[C@@H]1CCCN1C(=O)C1(O)CCCc2cnccc12 |r|
Show InChI InChI=1S/C23H27ClN4O3/c24-18-6-5-15(12-25)17(11-18)14-27-21(29)20-4-2-10-28(20)22(30)23(31)8-1-3-16-13-26-9-7-19(16)23/h5-7,9,11,13,20,31H,1-4,8,10,12,14,25H2,(H,27,29)/t20-,23?/m0/s1
US Patent
4.80n/an/an/an/an/an/a7.4n/a
Merck Sharp & Dohme Corp.
US Patent
Assay Description
Relevant in vitro assays are referenced in Morrissette, et al., Bioorg. Med. Chem. Lett. 2004, 14, 4161-4164 and described in Lewis, et al. Thromb. R...
US Patent US9469608 (2016)
BindingDB Entry DOI: 10.7270/Q2F18XNQ