BDBM253004 US9469608, 32-7
SMILES: NCc1ccc(Cl)cc1CNC(=O)[C@@H]1CCCN1C(=O)C1(O)CCCc2cccnc12
InChI Key: InChIKey=BXLMJFVUCMLTEC-HSTJUUNISA-N
Data: 1 KI
Activity Spreadsheet -- Enzyme Inhibition Constant Data from BindingDB
Found 1 hit for monomerid = 253004
Trg + Lig
Ki
nM
ΔG°
kcal/mole
IC50
nM
Kd
nM
EC50/IC50
nM
koff
s-1
kon
M-1s-1
pHTemp
°C
Prothrombin
(Homo sapiens (Human))
BDBM253004
(US9469608, 32-7)
Show SMILES NCc1ccc(Cl)cc1CNC(=O)[C@@H]1CCCN1C(=O)C1(O)CCCc2cccnc12 |r|
Show InChI InChI=1S/C23H27ClN4O3/c24-18-8-7-16(13-25)17(12-18)14-27-21(29)19-6-3-11-28(19)22(30)23(31)9-1-4-15-5-2-10-26-20(15)23/h2,5,7-8,10,12,19,31H,1,3-4,6,9,11,13-14,25H2,(H,27,29)/t19-,23?/m0/s1
US Patent
3.90n/an/an/an/an/an/a7.4n/a
Merck Sharp & Dohme Corp.
US Patent
Assay Description
Relevant in vitro assays are referenced in Morrissette, et al., Bioorg. Med. Chem. Lett. 2004, 14, 4161-4164 and described in Lewis, et al. Thromb. R...
US Patent US9469608 (2016)
BindingDB Entry DOI: 10.7270/Q2F18XNQ