BDBM25329 N-[(4-fluorophenyl)methyl]-5-hydroxy-1-methyl-2-[2-(morpholin-4-yl)propan-2-yl]-6-oxo-1,6-dihydropyrimidine-4-carboxamide::N-methyl-pyrimidinone derivative, 5
SMILES: Cn1c(nc(C(=O)NCc2ccc(F)cc2)c(O)c1=O)C(C)(C)N1CCOCC1
InChI Key: InChIKey=LVSLGGSSHFNPJF-UHFFFAOYSA-N
Data: 1 IC50
Activity Spreadsheet -- Enzyme Inhibition Constant Data from BindingDB
Found 1 hit for monomerid = 25329
Trg + Lig
Ki
nM
ΔG°
kcal/mole
IC50
nM
Kd
nM
EC50/IC50
nM
koff
s-1
kon
M-1s-1
pHTemp
°C
Gag-Pol polyprotein
(Human immunodeficiency virus type 1 group M subtyp...)
BDBM25329
(N-[(4-fluorophenyl)methyl]-5-hydroxy-1-methyl-2-[2...)
Show SMILES Cn1c(nc(C(=O)NCc2ccc(F)cc2)c(O)c1=O)C(C)(C)N1CCOCC1
Show InChI InChI=1S/C20H25FN4O4/c1-20(2,25-8-10-29-11-9-25)19-23-15(16(26)18(28)24(19)3)17(27)22-12-13-4-6-14(21)7-5-13/h4-7,26H,8-12H2,1-3H3,(H,22,27)
n/an/a 3n/an/an/an/a7.837
Merck Research Laboratories
Assay Description
The microtiter plate assay for stand transfer was performed with an immobilized donor substrate and a target substrate biotinylated at the 3-prime en...
J Med Chem 51: 5843-55 (2008)
Article DOI: 10.1021/jm800245z
BindingDB Entry DOI: 10.7270/Q2QJ7FMR