BDBM253626 US9701672, 57
SMILES: COc1cc(OCCCC(F)(F)F)ccc1[C@@]1(CC(c2ccc(s2)C2CC2)=C(c2nnn[nH]2)C(=O)N1)C(F)(F)F
InChI Key:
Data: 1 IC50
Activity Spreadsheet -- Enzyme Inhibition Constant Data from BindingDB
Found 1 hit for monomerid = 253626
Trg + Lig
Ki
nM
ΔG°
kcal/mole
IC50
nM
Kd
nM
EC50/IC50
nM
koff
s-1
kon
M-1s-1
pHTemp
°C
Alpha-1,6-mannosyl-glycoprotein 2-beta-N-acetylglucosaminyltransferase
(Homo sapiens (Human))
BDBM253626
(US9701672, 57)
Show SMILES COc1cc(OCCCC(F)(F)F)ccc1[C@@]1(CC(c2ccc(s2)C2CC2)=C(c2nnn[nH]2)C(=O)N1)C(F)(F)F |r,t:29|
US Patent
n/an/a 1.40n/an/an/an/a7.4n/a
Bristol-Myers Squibb Company
US Patent
Assay Description
The MGAT enzyme reactions were performed in Corning FALCONŽ 96-well polypropylene plates, in a total volume of 60 μL of 50 mM potassium phosphat...
US Patent US9701672 (2017)
BindingDB Entry DOI: 10.7270/Q2DV1MXW