BDBM254055 US9493430, 668
SMILES: C[C@H]1[C@H](OC(=O)N1CC1=C(CCC(C)(C)C1)c1cc(F)cc(c1)-c1ccc(cc1C(F)(F)F)C(O)=O)c1cc(cc(c1)C(F)(F)F)C(F)(F)F
InChI Key: InChIKey=VYQGNYOWGAICSO-ADKRDUOOSA-N
Data: 1 IC50
Activity Spreadsheet -- Enzyme Inhibition Constant Data from BindingDB
Found 1 hit for monomerid = 254055
Trg + Lig
Ki
nM
ΔG°
kcal/mole
IC50
nM
Kd
nM
EC50/IC50
nM
koff
s-1
kon
M-1s-1
pHTemp
°C
Cholesteryl ester transfer protein
(Homo sapiens (Human))
BDBM254055
(US9493430, 668)
Show SMILES C[C@H]1[C@H](OC(=O)N1CC1=C(CCC(C)(C)C1)c1cc(F)cc(c1)-c1ccc(cc1C(F)(F)F)C(O)=O)c1cc(cc(c1)C(F)(F)F)C(F)(F)F |r,t:9|
Show InChI InChI=1S/C35H29F10NO4/c1-17-29(21-9-23(33(37,38)39)14-24(10-21)34(40,41)42)50-31(49)46(17)16-22-15-32(2,3)7-6-26(22)19-8-20(12-25(36)11-19)27-5-4-18(30(47)48)13-28(27)35(43,44)45/h4-5,8-14,17,29H,6-7,15-16H2,1-3H3,(H,47,48)/t17-,29-/m0/s1
Reactome pathway
US Patent
n/an/a 5n/an/an/an/an/an/a
Chong Kun Dang Pharmaceutical Corp.
US Patent
Assay Description
As a protein source for cholesteryl ester transfer, plasma from healthy persons was used, and as a cholesteryl ester receptor, LDL from healthy perso...
US Patent US9493430 (2016)
BindingDB Entry DOI: 10.7270/Q2W37V7V