BDBM254058 US9493430, 684
SMILES: COc1cc(C)c(cc1C1=C(CN2[C@@H](C)[C@H](OC2=O)c2cc(cc(c2)C(F)(F)F)C(F)(F)F)CC(C)(C)CC1)-c1ccc(cc1C)C(O)=O
InChI Key: InChIKey=JZCDRLOHYWCQGY-MNAQKMTRSA-N
Data: 1 IC50
Activity Spreadsheet -- Enzyme Inhibition Constant Data from BindingDB
Found 1 hit for monomerid = 254058
Trg + Lig
Ki
nM
ΔG°
kcal/mole
IC50
nM
Kd
nM
EC50/IC50
nM
koff
s-1
kon
M-1s-1
pHTemp
°C
Cholesteryl ester transfer protein
(Homo sapiens (Human))
BDBM254058
(US9493430, 684)
Show SMILES COc1cc(C)c(cc1C1=C(CN2[C@@H](C)[C@H](OC2=O)c2cc(cc(c2)C(F)(F)F)C(F)(F)F)CC(C)(C)CC1)-c1ccc(cc1C)C(O)=O |r,c:10|
Show InChI InChI=1S/C37H37F6NO5/c1-19-11-22(33(45)46)7-8-27(19)29-16-30(31(48-6)12-20(29)2)28-9-10-35(4,5)17-24(28)18-44-21(3)32(49-34(44)47)23-13-25(36(38,39)40)15-26(14-23)37(41,42)43/h7-8,11-16,21,32H,9-10,17-18H2,1-6H3,(H,45,46)/t21-,32-/m0/s1
Reactome pathway
US Patent
n/an/a 1.90n/an/an/an/an/an/a
Chong Kun Dang Pharmaceutical Corp.
US Patent
Assay Description
As a protein source for cholesteryl ester transfer, plasma from healthy persons was used, and as a cholesteryl ester receptor, LDL from healthy perso...
US Patent US9493430 (2016)
BindingDB Entry DOI: 10.7270/Q2W37V7V