BDBM254123 US9481677, 77
SMILES: Fc1cc(c(F)cc1Oc1ccc(Cl)cc1-c1ccc2NC(=O)Cc2c1)S(=O)(=O)Nc1ncns1
InChI Key: InChIKey=IJRISICIUIFZOC-UHFFFAOYSA-N
Data: 1 IC50
Activity Spreadsheet -- Enzyme Inhibition Constant Data from BindingDB
Found 1 hit for monomerid = 254123
Trg + Lig
Ki
nM
ΔG°
kcal/mole
IC50
nM
Kd
nM
EC50/IC50
nM
koff
s-1
kon
M-1s-1
pHTemp
°C
Sodium channel protein type 9 subunit alpha
(Homo sapiens (Human))
BDBM254123
(US9481677, 77)
Show SMILES Fc1cc(c(F)cc1Oc1ccc(Cl)cc1-c1ccc2NC(=O)Cc2c1)S(=O)(=O)Nc1ncns1
Show InChI InChI=1S/C22H13ClF2N4O4S2/c23-13-2-4-18(14(7-13)11-1-3-17-12(5-11)6-21(30)28-17)33-19-8-16(25)20(9-15(19)24)35(31,32)29-22-26-10-27-34-22/h1-5,7-10H,6H2,(H,28,30)(H,26,27,29)
US Patent
n/an/a 7.40n/an/an/an/an/an/a
XENON PHARMACEUTICALS INC.
US Patent
Assay Description
Patch voltage clamp electrophysiology allows for the direct measurement and quantification of block of voltage-gated sodium channels (Nav's), and...
US Patent US9481677 (2016)
BindingDB Entry DOI: 10.7270/Q20V8BQT