BDBM254273 US10112937, Example 168::US10150765, Example 168::US10703749, Example 168::US9464084, 168
SMILES: C[C@H]1Cc2c(CN1C(=O)c1cccc(c1Cl)C(F)(F)F)nnn2-c1ncccc1F
InChI Key: InChIKey=FYHMQHJIZZNUCO-JTQLQIEISA-N
Data: 5 KI  10 IC50
Activity Spreadsheet -- Enzyme Inhibition Constant Data from BindingDB
Found 15 hits for monomerid = 254273
Trg + Lig
Ki
nM
ΔG°
kcal/mole
IC50
nM
Kd
nM
EC50/IC50
nM
koff
s-1
kon
M-1s-1
pHTemp
°C
P2X purinoceptor 7
(Homo sapiens (Human))
BDBM254273
(US10112937, Example 168 | US10150765, Example 168 ...)
Show SMILES C[C@H]1Cc2c(CN1C(=O)c1cccc(c1Cl)C(F)(F)F)nnn2-c1ncccc1F |r|
Show InChI InChI=1S/C19H14ClF4N5O/c1-10-8-15-14(26-27-29(15)17-13(21)6-3-7-25-17)9-28(10)18(30)11-4-2-5-12(16(11)20)19(22,23)24/h2-7,10H,8-9H2,1H3/t10-/m0/s1
US Patent
3.20n/an/an/an/an/an/an/an/a
Janssen Pharmaceutica NV
US Patent
Assay Description
uman or rat P2X7-1321N1 cells were collected and frozen @−80° C. On the day of the experiment, cell membrane preparations were made according t...
US Patent US10112937 (2018)
BindingDB Entry DOI: 10.7270/Q25H7J9N
P2X purinoceptor 7
(Homo sapiens (Human))
BDBM254273
(US10112937, Example 168 | US10150765, Example 168 ...)
Show SMILES C[C@H]1Cc2c(CN1C(=O)c1cccc(c1Cl)C(F)(F)F)nnn2-c1ncccc1F |r|
Show InChI InChI=1S/C19H14ClF4N5O/c1-10-8-15-14(26-27-29(15)17-13(21)6-3-7-25-17)9-28(10)18(30)11-4-2-5-12(16(11)20)19(22,23)24/h2-7,10H,8-9H2,1H3/t10-/m0/s1
US Patent
3.20n/an/an/an/an/an/an/an/a
Janssen Pharmaceutica NV
US Patent
Assay Description
Human or rat P2X7-1321 N1 cells were collected and frozen @−80° C. On the day of the experiment, cell membrane preparations were made according...
US Patent US10703749 (2020)
P2X purinoceptor 7
(Homo sapiens (Human))
BDBM254273
(US10112937, Example 168 | US10150765, Example 168 ...)
Show SMILES C[C@H]1Cc2c(CN1C(=O)c1cccc(c1Cl)C(F)(F)F)nnn2-c1ncccc1F |r|
Show InChI InChI=1S/C19H14ClF4N5O/c1-10-8-15-14(26-27-29(15)17-13(21)6-3-7-25-17)9-28(10)18(30)11-4-2-5-12(16(11)20)19(22,23)24/h2-7,10H,8-9H2,1H3/t10-/m0/s1
US Patent
3.20n/an/an/an/an/an/an/an/a
Janssen Pharmaceutica NV
US Patent
Assay Description
human or rat P2X7-1321 N1 cells were collected and frozen @−80° C. On the day of the experiment, cell membrane preparations were made according...
US Patent US9464084 (2016)
BindingDB Entry DOI: 10.7270/Q27D2T3Z
P2X purinoceptor 7
(Homo sapiens (Human))
BDBM254273
(US10112937, Example 168 | US10150765, Example 168 ...)
Show SMILES C[C@H]1Cc2c(CN1C(=O)c1cccc(c1Cl)C(F)(F)F)nnn2-c1ncccc1F |r|
Show InChI InChI=1S/C19H14ClF4N5O/c1-10-8-15-14(26-27-29(15)17-13(21)6-3-7-25-17)9-28(10)18(30)11-4-2-5-12(16(11)20)19(22,23)24/h2-7,10H,8-9H2,1H3/t10-/m0/s1
US Patent
3.20n/an/an/an/an/an/an/an/a
Janssen Pharmaceutica NV
US Patent
Assay Description
uman or rat P2X7-1321N1 cells were collected and frozen @−80° C. On the day of the experiment, cell membrane preparations were made according t...
US Patent US10112937 (2018)
BindingDB Entry DOI: 10.7270/Q25H7J9N
P2X purinoceptor 7
(Homo sapiens (Human))
BDBM254273
(US10112937, Example 168 | US10150765, Example 168 ...)
Show SMILES C[C@H]1Cc2c(CN1C(=O)c1cccc(c1Cl)C(F)(F)F)nnn2-c1ncccc1F |r|
Show InChI InChI=1S/C19H14ClF4N5O/c1-10-8-15-14(26-27-29(15)17-13(21)6-3-7-25-17)9-28(10)18(30)11-4-2-5-12(16(11)20)19(22,23)24/h2-7,10H,8-9H2,1H3/t10-/m0/s1
US Patent
3.20n/an/an/an/an/an/an/an/a
Janssen Pharmaceutica NV
US Patent
Assay Description
Human or rat P2X7-1321N1 cells were collected and frozen @ −80° C. On the day of the experiment, cell membrane preparations were made according...
US Patent US10150765 (2018)
BindingDB Entry DOI: 10.7270/Q23T9K8V
P2X purinoceptor 7 (P2X7)
(Rattus norvegicus (Rat))
BDBM254273
(US10112937, Example 168 | US10150765, Example 168 ...)
Show SMILES C[C@H]1Cc2c(CN1C(=O)c1cccc(c1Cl)C(F)(F)F)nnn2-c1ncccc1F |r|
Show InChI InChI=1S/C19H14ClF4N5O/c1-10-8-15-14(26-27-29(15)17-13(21)6-3-7-25-17)9-28(10)18(30)11-4-2-5-12(16(11)20)19(22,23)24/h2-7,10H,8-9H2,1H3/t10-/m0/s1
US Patent
n/an/a 4.90n/an/an/an/a7.4n/a
Janssen Pharmaceutica NV
US Patent
Assay Description
1321N1 cells expressing the recombinant human or rat P2X7 channel was cultured in HyQ DME/(HyClone/Dulbecco's Modified Eagle Medium) high glucose...
US Patent US10112937 (2018)
BindingDB Entry DOI: 10.7270/Q25H7J9N
P2X purinoceptor 7
(Homo sapiens (Human))
BDBM254273
(US10112937, Example 168 | US10150765, Example 168 ...)
Show SMILES C[C@H]1Cc2c(CN1C(=O)c1cccc(c1Cl)C(F)(F)F)nnn2-c1ncccc1F |r|
Show InChI InChI=1S/C19H14ClF4N5O/c1-10-8-15-14(26-27-29(15)17-13(21)6-3-7-25-17)9-28(10)18(30)11-4-2-5-12(16(11)20)19(22,23)24/h2-7,10H,8-9H2,1H3/t10-/m0/s1
US Patent
n/an/a 3.60n/an/an/an/an/an/a
Janssen Pharmaceutica NV
US Patent
Assay Description
1321N1 cells expressing the recombinant human, rat or mouse P2X7 channel was cultured in HyQ DME/(HyClone/Dulbecco's Modified Eagle Medium) high ...
US Patent US10150765 (2018)
BindingDB Entry DOI: 10.7270/Q23T9K8V
P2X purinoceptor 7 (P2X7)
(Rattus norvegicus (Rat))
BDBM254273
(US10112937, Example 168 | US10150765, Example 168 ...)
Show SMILES C[C@H]1Cc2c(CN1C(=O)c1cccc(c1Cl)C(F)(F)F)nnn2-c1ncccc1F |r|
Show InChI InChI=1S/C19H14ClF4N5O/c1-10-8-15-14(26-27-29(15)17-13(21)6-3-7-25-17)9-28(10)18(30)11-4-2-5-12(16(11)20)19(22,23)24/h2-7,10H,8-9H2,1H3/t10-/m0/s1
US Patent
n/an/a 4.90n/an/an/an/an/an/a
Janssen Pharmaceutica NV
US Patent
Assay Description
1321N1 cells expressing the recombinant human, rat or mouse P2X7 channel was cultured in HyQ DME/(HyClone/Dulbecco's Modified Eagle Medium) high ...
US Patent US10150765 (2018)
BindingDB Entry DOI: 10.7270/Q23T9K8V
P2X purinoceptor 7
(Homo sapiens (Human))
BDBM254273
(US10112937, Example 168 | US10150765, Example 168 ...)
Show SMILES C[C@H]1Cc2c(CN1C(=O)c1cccc(c1Cl)C(F)(F)F)nnn2-c1ncccc1F |r|
Show InChI InChI=1S/C19H14ClF4N5O/c1-10-8-15-14(26-27-29(15)17-13(21)6-3-7-25-17)9-28(10)18(30)11-4-2-5-12(16(11)20)19(22,23)24/h2-7,10H,8-9H2,1H3/t10-/m0/s1
US Patent
n/an/a 3.60n/an/an/an/an/an/a
Janssen Pharmaceutica NV
US Patent
Assay Description
Human or rat P2X7-1321 N1 cells were collected and frozen @−80° C. On the day of the experiment, cell membrane preparations were made according...
US Patent US10703749 (2020)
P2X purinoceptor 7
(Homo sapiens (Human))
BDBM254273
(US10112937, Example 168 | US10150765, Example 168 ...)
Show SMILES C[C@H]1Cc2c(CN1C(=O)c1cccc(c1Cl)C(F)(F)F)nnn2-c1ncccc1F |r|
Show InChI InChI=1S/C19H14ClF4N5O/c1-10-8-15-14(26-27-29(15)17-13(21)6-3-7-25-17)9-28(10)18(30)11-4-2-5-12(16(11)20)19(22,23)24/h2-7,10H,8-9H2,1H3/t10-/m0/s1
US Patent
n/an/a 3.60n/an/an/an/a7.4n/a
Janssen Pharmaceutica NV
US Patent
Assay Description
1321N1 cells expressing the recombinant human or rat P2X7 channel was cultured in HyQ DME/(HyClone/Dulbecco's Modified Eagle Medium) high glucose...
US Patent US10112937 (2018)
BindingDB Entry DOI: 10.7270/Q25H7J9N
P2X purinoceptor 7 (P2X7)
(Rattus norvegicus (Rat))
BDBM254273
(US10112937, Example 168 | US10150765, Example 168 ...)
Show SMILES C[C@H]1Cc2c(CN1C(=O)c1cccc(c1Cl)C(F)(F)F)nnn2-c1ncccc1F |r|
Show InChI InChI=1S/C19H14ClF4N5O/c1-10-8-15-14(26-27-29(15)17-13(21)6-3-7-25-17)9-28(10)18(30)11-4-2-5-12(16(11)20)19(22,23)24/h2-7,10H,8-9H2,1H3/t10-/m0/s1
US Patent
n/an/a 4.90n/an/an/an/a7.4n/a
Janssen Pharmaceutica NV
US Patent
Assay Description
1321N1 cells expressing the recombinant human or rat P2X7 channel was cultured in HyQ DME/(HyClone/Dulbecco's Modified Eagle Medium) high glucose...
US Patent US10112937 (2018)
BindingDB Entry DOI: 10.7270/Q25H7J9N
P2X purinoceptor 7
(Homo sapiens (Human))
BDBM254273
(US10112937, Example 168 | US10150765, Example 168 ...)
Show SMILES C[C@H]1Cc2c(CN1C(=O)c1cccc(c1Cl)C(F)(F)F)nnn2-c1ncccc1F |r|
Show InChI InChI=1S/C19H14ClF4N5O/c1-10-8-15-14(26-27-29(15)17-13(21)6-3-7-25-17)9-28(10)18(30)11-4-2-5-12(16(11)20)19(22,23)24/h2-7,10H,8-9H2,1H3/t10-/m0/s1
US Patent
n/an/a 3.60n/an/an/an/a7.4n/a
Janssen Pharmaceutica NV
US Patent
Assay Description
1321N1 cells expressing the recombinant human or rat P2X7 channel was cultured in HyQ DME/(HyClone/Dulbecco's Modified Eagle Medium) high glucose...
US Patent US10112937 (2018)
BindingDB Entry DOI: 10.7270/Q25H7J9N
P2X purinoceptor 7 (P2X7)
(Rattus norvegicus (Rat))
BDBM254273
(US10112937, Example 168 | US10150765, Example 168 ...)
Show SMILES C[C@H]1Cc2c(CN1C(=O)c1cccc(c1Cl)C(F)(F)F)nnn2-c1ncccc1F |r|
Show InChI InChI=1S/C19H14ClF4N5O/c1-10-8-15-14(26-27-29(15)17-13(21)6-3-7-25-17)9-28(10)18(30)11-4-2-5-12(16(11)20)19(22,23)24/h2-7,10H,8-9H2,1H3/t10-/m0/s1
US Patent
n/an/a 4.90n/an/an/an/a7.4n/a
Janssen Pharmaceutica NV
US Patent
Assay Description
1321 N1 cells expressing the recombinant human, rat or mouse P2X7 channel was cultured in HyQ DME/(HyClone/Dulbecco's Modified Eagle Medium) high glu...
US Patent US9464084 (2016)
BindingDB Entry DOI: 10.7270/Q27D2T3Z
P2X purinoceptor 7
(Rattus norvegicus (Rat))
BDBM254273
(US10112937, Example 168 | US10150765, Example 168 ...)
Show SMILES C[C@H]1Cc2c(CN1C(=O)c1cccc(c1Cl)C(F)(F)F)nnn2-c1ncccc1F |r|
Show InChI InChI=1S/C19H14ClF4N5O/c1-10-8-15-14(26-27-29(15)17-13(21)6-3-7-25-17)9-28(10)18(30)11-4-2-5-12(16(11)20)19(22,23)24/h2-7,10H,8-9H2,1H3/t10-/m0/s1
US Patent
n/an/a 4.90n/an/an/an/an/an/a
Janssen Pharmaceutica NV
US Patent
Assay Description
Human or rat P2X7-1321 N1 cells were collected and frozen @−80° C. On the day of the experiment, cell membrane preparations were made according...
US Patent US10703749 (2020)
P2X purinoceptor 7
(Homo sapiens (Human))
BDBM254273
(US10112937, Example 168 | US10150765, Example 168 ...)
Show SMILES C[C@H]1Cc2c(CN1C(=O)c1cccc(c1Cl)C(F)(F)F)nnn2-c1ncccc1F |r|
Show InChI InChI=1S/C19H14ClF4N5O/c1-10-8-15-14(26-27-29(15)17-13(21)6-3-7-25-17)9-28(10)18(30)11-4-2-5-12(16(11)20)19(22,23)24/h2-7,10H,8-9H2,1H3/t10-/m0/s1
US Patent
n/an/a 3.60n/an/an/an/a7.4n/a
Janssen Pharmaceutica NV
US Patent
Assay Description
1321 N1 cells expressing the recombinant human, rat or mouse P2X7 channel was cultured in HyQ DME/(HyClone/Dulbecco's Modified Eagle Medium) high glu...
US Patent US9464084 (2016)
BindingDB Entry DOI: 10.7270/Q27D2T3Z