BDBM2544 US8507510, 1.23::US8507510, 1.41
SMILES: COc1cc(Nc2ncc(Br)c(N[C@H](C)C(C)(C)O)n2)ccc1S(C)(=N)=O
InChI Key: InChIKey=VEMUNZLIOXAWMA-VQLJPOJZSA-N
Data: 6 IC50
Activity Spreadsheet -- Enzyme Inhibition Constant Data from BindingDB
Found 6 hits for monomerid = 2544
Trg + Lig
Ki
nM
ΔG°
kcal/mole
IC50
nM
Kd
nM
EC50/IC50
nM
koff
s-1
kon
M-1s-1
pHTemp
°C
Cyclin-dependent kinase 2
(Homo sapiens (Human))
BDBM2544
(US8507510, 1.23 | US8507510, 1.41)
Show SMILES COc1cc(Nc2ncc(Br)c(N[C@H](C)C(C)(C)O)n2)ccc1S(C)(=N)=O |r|
Show InChI InChI=1S/C17H24BrN5O3S/c1-10(17(2,3)24)21-15-12(18)9-20-16(23-15)22-11-6-7-14(27(5,19)25)13(8-11)26-4/h6-10,19,24H,1-5H3,(H2,20,21,22,23)/t10-,27?/m1/s1
NCI pathway
Reactome pathway
US Patent
n/an/a 2n/an/an/an/an/an/a
Bayer Intellectual Property GmbH
US Patent
Assay Description
Kinase assay using either CDK1, CDK2 or VEGFR-2.
US Patent US8507510 (2013)
BindingDB Entry DOI: 10.7270/Q2V69H76
Cyclin-dependent kinase 1
(Homo sapiens (Human))
BDBM2544
(US8507510, 1.23 | US8507510, 1.41)
Show SMILES COc1cc(Nc2ncc(Br)c(N[C@H](C)C(C)(C)O)n2)ccc1S(C)(=N)=O |r|
Show InChI InChI=1S/C17H24BrN5O3S/c1-10(17(2,3)24)21-15-12(18)9-20-16(23-15)22-11-6-7-14(27(5,19)25)13(8-11)26-4/h6-10,19,24H,1-5H3,(H2,20,21,22,23)/t10-,27?/m1/s1
Reactome pathway
US Patent
n/an/a 2n/an/an/an/an/an/a
Bayer Intellectual Property GmbH
US Patent
Assay Description
Kinase assay using either CDK1, CDK2 or VEGFR-2.
US Patent US8507510 (2013)
BindingDB Entry DOI: 10.7270/Q2V69H76
Vascular endothelial growth factor receptor 2
(Homo sapiens (Human))
BDBM2544
(US8507510, 1.23 | US8507510, 1.41)
Show SMILES COc1cc(Nc2ncc(Br)c(N[C@H](C)C(C)(C)O)n2)ccc1S(C)(=N)=O |r|
Show InChI InChI=1S/C17H24BrN5O3S/c1-10(17(2,3)24)21-15-12(18)9-20-16(23-15)22-11-6-7-14(27(5,19)25)13(8-11)26-4/h6-10,19,24H,1-5H3,(H2,20,21,22,23)/t10-,27?/m1/s1
NCI pathway
Reactome pathway
US Patent
n/an/a 75n/an/an/an/an/an/a
Bayer Intellectual Property GmbH
US Patent
Assay Description
Kinase assay using either CDK1, CDK2 or VEGFR-2.
US Patent US8507510 (2013)
BindingDB Entry DOI: 10.7270/Q2V69H76
Cyclin-dependent kinase 2
(Homo sapiens (Human))
BDBM2544
(US8507510, 1.23 | US8507510, 1.41)
Show SMILES COc1cc(Nc2ncc(Br)c(N[C@H](C)C(C)(C)O)n2)ccc1S(C)(=N)=O |r|
Show InChI InChI=1S/C17H24BrN5O3S/c1-10(17(2,3)24)21-15-12(18)9-20-16(23-15)22-11-6-7-14(27(5,19)25)13(8-11)26-4/h6-10,19,24H,1-5H3,(H2,20,21,22,23)/t10-,27?/m1/s1
NCI pathway
Reactome pathway
US Patent
n/an/a 6n/an/an/an/an/an/a
Bayer Intellectual Property GmbH
US Patent
Assay Description
Kinase assay using either CDK1, CDK2 or VEGFR-2.
US Patent US8507510 (2013)
BindingDB Entry DOI: 10.7270/Q2V69H76
Cyclin-dependent kinase 1
(Homo sapiens (Human))
BDBM2544
(US8507510, 1.23 | US8507510, 1.41)
Show SMILES COc1cc(Nc2ncc(Br)c(N[C@H](C)C(C)(C)O)n2)ccc1S(C)(=N)=O |r|
Show InChI InChI=1S/C17H24BrN5O3S/c1-10(17(2,3)24)21-15-12(18)9-20-16(23-15)22-11-6-7-14(27(5,19)25)13(8-11)26-4/h6-10,19,24H,1-5H3,(H2,20,21,22,23)/t10-,27?/m1/s1
Reactome pathway
US Patent
n/an/a 8n/an/an/an/an/an/a
Bayer Intellectual Property GmbH
US Patent
Assay Description
Kinase assay using either CDK1, CDK2 or VEGFR-2.
US Patent US8507510 (2013)
BindingDB Entry DOI: 10.7270/Q2V69H76
Vascular endothelial growth factor receptor 2
(Homo sapiens (Human))
BDBM2544
(US8507510, 1.23 | US8507510, 1.41)
Show SMILES COc1cc(Nc2ncc(Br)c(N[C@H](C)C(C)(C)O)n2)ccc1S(C)(=N)=O |r|
Show InChI InChI=1S/C17H24BrN5O3S/c1-10(17(2,3)24)21-15-12(18)9-20-16(23-15)22-11-6-7-14(27(5,19)25)13(8-11)26-4/h6-10,19,24H,1-5H3,(H2,20,21,22,23)/t10-,27?/m1/s1
NCI pathway
Reactome pathway
US Patent
n/an/a 76n/an/an/an/an/an/a
Bayer Intellectual Property GmbH
US Patent
Assay Description
Kinase assay using either CDK1, CDK2 or VEGFR-2.
US Patent US8507510 (2013)
BindingDB Entry DOI: 10.7270/Q2V69H76