BDBM25448 4-[6-(4-fluorophenyl)-3,4-dihydronaphthalen-1-yl]pyridine::Abiraterone mimetic, 11
SMILES: Fc1ccc(cc1)-c1ccc2C(=CCCc2c1)c1ccncc1
InChI Key: InChIKey=PHOBLPLUIYOPJE-UHFFFAOYSA-N
Data: 4 IC50
Activity Spreadsheet -- Enzyme Inhibition Constant Data from BindingDB
Found 4 hits for monomerid = 25448
Trg + Lig
Ki
nM
ΔG°
kcal/mole
IC50
nM
Kd
nM
EC50/IC50
nM
koff
s-1
kon
M-1s-1
pHTemp
°C
Cytochrome P450 17A1
(Homo sapiens (Human))
BDBM25448
(4-[6-(4-fluorophenyl)-3,4-dihydronaphthalen-1-yl]p...)
Show SMILES Fc1ccc(cc1)-c1ccc2C(=CCCc2c1)c1ccncc1 |c:12|
Show InChI InChI=1S/C21H16FN/c22-19-7-4-15(5-8-19)17-6-9-21-18(14-17)2-1-3-20(21)16-10-12-23-13-11-16/h3-14H,1-2H2
Reactome pathway
n/an/a>5.00E+3n/an/an/an/a7.437
Saarland University
Assay Description
The 17 alpha-hydroxylase activity of CYP 17 was determined by measuring the conversion of progesterone into 17 alpha-hydroxyprogesterone and the bypr...
J Med Chem 51: 5009-18 (2008)
Article DOI: 10.1021/jm800355c
BindingDB Entry DOI: 10.7270/Q2TB156N
Cytochrome P450 3A4
(Homo sapiens (Human))
BDBM25448
(4-[6-(4-fluorophenyl)-3,4-dihydronaphthalen-1-yl]p...)
Show SMILES Fc1ccc(cc1)-c1ccc2C(=CCCc2c1)c1ccncc1 |c:12|
Show InChI InChI=1S/C21H16FN/c22-19-7-4-15(5-8-19)17-6-9-21-18(14-17)2-1-3-20(21)16-10-12-23-13-11-16/h3-14H,1-2H2
Reactome pathway
n/an/a 4.20E+3n/an/an/an/an/an/a
Saarland University
Assay Description
To measure CYP3A4 activity, the product of testosterone 6-hydroxylation, 6beta-hydroxytestosterone was determined. After incubation, the reaction was...
J Med Chem 51: 5009-18 (2008)
Article DOI: 10.1021/jm800355c
BindingDB Entry DOI: 10.7270/Q2TB156N
Cytochrome P450 11B2 (CYP11B2)
(Homo sapiens (Human))
BDBM25448
(4-[6-(4-fluorophenyl)-3,4-dihydronaphthalen-1-yl]p...)
Show SMILES Fc1ccc(cc1)-c1ccc2C(=CCCc2c1)c1ccncc1 |c:12|
Show InChI InChI=1S/C21H16FN/c22-19-7-4-15(5-8-19)17-6-9-21-18(14-17)2-1-3-20(21)16-10-12-23-13-11-16/h3-14H,1-2H2
n/an/a 121n/an/an/an/an/an/a
Saarland University
Assay Description
The enzyme activity was assayed by monitoring the conversion of deoxycorticosterone to corticosterone in the presence of inhibitor compounds. The pro...
J Med Chem 51: 5009-18 (2008)
Article DOI: 10.1021/jm800355c
BindingDB Entry DOI: 10.7270/Q2TB156N
Cytochrome P450 11B1, mitochondrial
(Homo sapiens (Human))
BDBM25448
(4-[6-(4-fluorophenyl)-3,4-dihydronaphthalen-1-yl]p...)
Show SMILES Fc1ccc(cc1)-c1ccc2C(=CCCc2c1)c1ccncc1 |c:12|
Show InChI InChI=1S/C21H16FN/c22-19-7-4-15(5-8-19)17-6-9-21-18(14-17)2-1-3-20(21)16-10-12-23-13-11-16/h3-14H,1-2H2
n/an/a>1.00E+4n/an/an/an/an/an/a
Saarland University
Assay Description
The enzyme activity was assayed by monitoring the conversion of deoxycorticosterone to corticosterone in the presence of inhibitor compounds. The pro...
J Med Chem 51: 5009-18 (2008)
Article DOI: 10.1021/jm800355c
BindingDB Entry DOI: 10.7270/Q2TB156N