BDBM254601 US9469597, 2
SMILES: NC1CCC(CC1)N[C@H]1C[C@@H]1c1ccccc1
InChI Key: InChIKey=ALHBJBCQLJZYON-CVSAEHQPSA-N
Data: 3 KI  3 IC50
Activity Spreadsheet -- Enzyme Inhibition Constant Data from BindingDB
Found 6 hits for monomerid = 254601
Trg + Lig
Ki
nM
ΔG°
kcal/mole
IC50
nM
Kd
nM
EC50/IC50
nM
koff
s-1
kon
M-1s-1
pHTemp
°C
GST-Lysine Specific Demethylase-1 (LSD1)
(Homo sapiens (Human))
BDBM254601
(US9469597, 2)
Show SMILES NC1CCC(CC1)N[C@H]1C[C@@H]1c1ccccc1 |wU:8.8,wD:10.12,(11.17,-2.23,;9.76,-2.86,;8.52,-1.95,;7.11,-2.58,;6.95,-4.11,;8.19,-5.02,;9.6,-4.39,;5.54,-4.74,;4.21,-3.97,;2.67,-3.97,;3.44,-2.64,;3.44,-1.1,;2.1,-.33,;2.1,1.21,;3.44,1.98,;4.77,1.21,;4.77,-.33,)|
Show InChI InChI=1S/C15H22N2/c16-12-6-8-13(9-7-12)17-15-10-14(15)11-4-2-1-3-5-11/h1-5,12-15,17H,6-10,16H2/t12?,13?,14-,15+/m1/s1
US Patent
550 -8.88n/an/an/an/an/a7.437
Oryzon Genomics S.A.
US Patent
Assay Description
The compounds of the invention can be tested for their ability to inhibit LSD1. The ability of the compounds of the invention to inhibit LSD1 can be ...
US Patent US9469597 (2016)
BindingDB Entry DOI: 10.7270/Q2ZW1JVG
Amine oxidase [flavin-containing] B
(Homo sapiens (Human))
BDBM254601
(US9469597, 2)
Show SMILES NC1CCC(CC1)N[C@H]1C[C@@H]1c1ccccc1 |wU:8.8,wD:10.12,(11.17,-2.23,;9.76,-2.86,;8.52,-1.95,;7.11,-2.58,;6.95,-4.11,;8.19,-5.02,;9.6,-4.39,;5.54,-4.74,;4.21,-3.97,;2.67,-3.97,;3.44,-2.64,;3.44,-1.1,;2.1,-.33,;2.1,1.21,;3.44,1.98,;4.77,1.21,;4.77,-.33,)|
Show InChI InChI=1S/C15H22N2/c16-12-6-8-13(9-7-12)17-15-10-14(15)11-4-2-1-3-5-11/h1-5,12-15,17H,6-10,16H2/t12?,13?,14-,15+/m1/s1
US Patent
>4.00E+4>-6.24n/an/an/an/an/a7.537
Oryzon Genomics S.A.
US Patent
Assay Description
In order to monitor MAO enzymatic activities and/or their inhibition rate by inhibitor(s) of interest, a fluorescence-based (inhibitor)-screening ass...
US Patent US9469597 (2016)
BindingDB Entry DOI: 10.7270/Q2ZW1JVG
Amine oxidase (flavin-containing) A
(Homo sapiens (Human))
BDBM254601
(US9469597, 2)
Show SMILES NC1CCC(CC1)N[C@H]1C[C@@H]1c1ccccc1 |wU:8.8,wD:10.12,(11.17,-2.23,;9.76,-2.86,;8.52,-1.95,;7.11,-2.58,;6.95,-4.11,;8.19,-5.02,;9.6,-4.39,;5.54,-4.74,;4.21,-3.97,;2.67,-3.97,;3.44,-2.64,;3.44,-1.1,;2.1,-.33,;2.1,1.21,;3.44,1.98,;4.77,1.21,;4.77,-.33,)|
Show InChI InChI=1S/C15H22N2/c16-12-6-8-13(9-7-12)17-15-10-14(15)11-4-2-1-3-5-11/h1-5,12-15,17H,6-10,16H2/t12?,13?,14-,15+/m1/s1
US Patent
>4.00E+4>-6.24n/an/an/an/an/a7.537
Oryzon Genomics S.A.
US Patent
Assay Description
In order to monitor MAO enzymatic activities and/or their inhibition rate by inhibitor(s) of interest, a fluorescence-based (inhibitor)-screening ass...
US Patent US9469597 (2016)
BindingDB Entry DOI: 10.7270/Q2ZW1JVG
GST-Lysine Specific Demethylase-1 (LSD1)
(Homo sapiens (Human))
BDBM254601
(US9469597, 2)
Show SMILES NC1CCC(CC1)N[C@H]1C[C@@H]1c1ccccc1 |wU:8.8,wD:10.12,(11.17,-2.23,;9.76,-2.86,;8.52,-1.95,;7.11,-2.58,;6.95,-4.11,;8.19,-5.02,;9.6,-4.39,;5.54,-4.74,;4.21,-3.97,;2.67,-3.97,;3.44,-2.64,;3.44,-1.1,;2.1,-.33,;2.1,1.21,;3.44,1.98,;4.77,1.21,;4.77,-.33,)|
Show InChI InChI=1S/C15H22N2/c16-12-6-8-13(9-7-12)17-15-10-14(15)11-4-2-1-3-5-11/h1-5,12-15,17H,6-10,16H2/t12?,13?,14-,15+/m1/s1
US Patent
n/an/a 135n/an/an/an/a7.437
Oryzon Genomics S.A.
US Patent
Assay Description
The compounds of the invention can be tested for their ability to inhibit LSD1. The ability of the compounds of the invention to inhibit LSD1 can be ...
US Patent US9469597 (2016)
BindingDB Entry DOI: 10.7270/Q2ZW1JVG
Amine oxidase (flavin-containing) A
(Homo sapiens (Human))
BDBM254601
(US9469597, 2)
Show SMILES NC1CCC(CC1)N[C@H]1C[C@@H]1c1ccccc1 |wU:8.8,wD:10.12,(11.17,-2.23,;9.76,-2.86,;8.52,-1.95,;7.11,-2.58,;6.95,-4.11,;8.19,-5.02,;9.6,-4.39,;5.54,-4.74,;4.21,-3.97,;2.67,-3.97,;3.44,-2.64,;3.44,-1.1,;2.1,-.33,;2.1,1.21,;3.44,1.98,;4.77,1.21,;4.77,-.33,)|
Show InChI InChI=1S/C15H22N2/c16-12-6-8-13(9-7-12)17-15-10-14(15)11-4-2-1-3-5-11/h1-5,12-15,17H,6-10,16H2/t12?,13?,14-,15+/m1/s1
US Patent
n/an/a>1.00E+5n/an/an/an/a7.537
Oryzon Genomics S.A.
US Patent
Assay Description
In order to monitor MAO enzymatic activities and/or their inhibition rate by inhibitor(s) of interest, a fluorescence-based (inhibitor)-screening ass...
US Patent US9469597 (2016)
BindingDB Entry DOI: 10.7270/Q2ZW1JVG
Amine oxidase [flavin-containing] B
(Homo sapiens (Human))
BDBM254601
(US9469597, 2)
Show SMILES NC1CCC(CC1)N[C@H]1C[C@@H]1c1ccccc1 |wU:8.8,wD:10.12,(11.17,-2.23,;9.76,-2.86,;8.52,-1.95,;7.11,-2.58,;6.95,-4.11,;8.19,-5.02,;9.6,-4.39,;5.54,-4.74,;4.21,-3.97,;2.67,-3.97,;3.44,-2.64,;3.44,-1.1,;2.1,-.33,;2.1,1.21,;3.44,1.98,;4.77,1.21,;4.77,-.33,)|
Show InChI InChI=1S/C15H22N2/c16-12-6-8-13(9-7-12)17-15-10-14(15)11-4-2-1-3-5-11/h1-5,12-15,17H,6-10,16H2/t12?,13?,14-,15+/m1/s1
US Patent
n/an/a>1.00E+5n/an/an/an/a7.537
Oryzon Genomics S.A.
US Patent
Assay Description
In order to monitor MAO enzymatic activities and/or their inhibition rate by inhibitor(s) of interest, a fluorescence-based (inhibitor)-screening ass...
US Patent US9469597 (2016)
BindingDB Entry DOI: 10.7270/Q2ZW1JVG