BDBM25479 4-(4-fluorophenyl)-N-(1H-indazol-5-yl)-6-methyl-2-(4-methylphenyl)-1,4-dihydropyrimidine-5-carboxamide::Dihydropyrimidine, 8
SMILES: CC1=C(C(NC(=N1)c1ccc(C)cc1)c1ccc(F)cc1)C(=O)Nc1ccc2[nH]ncc2c1
InChI Key: InChIKey=SQTRIOMOPSFYQU-UHFFFAOYSA-N
Data: 1 IC50
Activity Spreadsheet -- Enzyme Inhibition Constant Data from BindingDB
Found 1 hit for monomerid = 25479
Trg + Lig
Ki
nM
ΔG°
kcal/mole
IC50
nM
Kd
nM
EC50/IC50
nM
koff
s-1
kon
M-1s-1
pHTemp
°C
Rho-associated protein kinase 1
(Homo sapiens (Human))
BDBM25479
(4-(4-fluorophenyl)-N-(1H-indazol-5-yl)-6-methyl-2-...)
Show SMILES CC1=C(C(NC(=N1)c1ccc(C)cc1)c1ccc(F)cc1)C(=O)Nc1ccc2[nH]ncc2c1 |c:5,t:1|
Show InChI InChI=1S/C26H22FN5O/c1-15-3-5-18(6-4-15)25-29-16(2)23(24(31-25)17-7-9-20(27)10-8-17)26(33)30-21-11-12-22-19(13-21)14-28-32-22/h3-14,24H,1-2H3,(H,28,32)(H,29,31)(H,30,33)
NCI pathway
Reactome pathway
n/an/a 101n/an/an/an/a7.422
GSK
Assay Description
The assay of Rock-1 activity involved incubation with peptide substrate and ATP33, and the incorporation of P33 into the peptide was quantified by Sc...
J Med Chem 51: 6631-4 (2008)
Article DOI: 10.1021/jm8005096
BindingDB Entry DOI: 10.7270/Q2F47MFZ