BDBM25492 4-(4-chloro-2-fluorophenyl)-N-(1H-indazol-5-yl)-2-(4-methoxyphenyl)-6-methyl-1,4-dihydropyrimidine-5-carboxamide::Dihydropyrimidine, 21
SMILES: COc1ccc(cc1)C1=NC(C)=C(C(N1)c1ccc(Cl)cc1F)C(=O)Nc1ccc2[nH]ncc2c1
InChI Key: InChIKey=GEWPHZNCWUIEEN-UHFFFAOYSA-N
Data: 1 IC50
Activity Spreadsheet -- Enzyme Inhibition Constant Data from BindingDB
Found 1 hit for monomerid = 25492
Trg + Lig
Ki
nM
ΔG°
kcal/mole
IC50
nM
Kd
nM
EC50/IC50
nM
koff
s-1
kon
M-1s-1
pHTemp
°C
Rho-associated protein kinase 1
(Homo sapiens (Human))
BDBM25492
(4-(4-chloro-2-fluorophenyl)-N-(1H-indazol-5-yl)-2-...)
Show SMILES COc1ccc(cc1)C1=NC(C)=C(C(N1)c1ccc(Cl)cc1F)C(=O)Nc1ccc2[nH]ncc2c1 |c:12,t:9|
Show InChI InChI=1S/C26H21ClFN5O2/c1-14-23(26(34)31-18-6-10-22-16(11-18)13-29-33-22)24(20-9-5-17(27)12-21(20)28)32-25(30-14)15-3-7-19(35-2)8-4-15/h3-13,24H,1-2H3,(H,29,33)(H,30,32)(H,31,34)
NCI pathway
Reactome pathway
n/an/a 5n/an/an/an/a7.422
GSK
Assay Description
The assay of Rock-1 activity involved incubation with peptide substrate and ATP33, and the incorporation of P33 into the peptide was quantified by Sc...
J Med Chem 51: 6631-4 (2008)
Article DOI: 10.1021/jm8005096
BindingDB Entry DOI: 10.7270/Q2F47MFZ