BDBM254945 US9505765, 35
SMILES: CC(C)COc1ncnc2[nH]cc(\C=C\C#N)c12
InChI Key: InChIKey=SPEMUMBPRQTTAA-ONEGZZNKSA-N
Data: 1 IC50
Activity Spreadsheet -- Enzyme Inhibition Constant Data from BindingDB
Found 1 hit for monomerid = 254945
Trg + Lig
Ki
nM
ΔG°
kcal/mole
IC50
nM
Kd
nM
EC50/IC50
nM
koff
s-1
kon
M-1s-1
pHTemp
°C
Mitogen-activated protein kinase kinase kinase 7 interacting protein 1
(Homo sapiens (Human))
BDBM254945
(US9505765, 35)
Show SMILES CC(C)COc1ncnc2[nH]cc(\C=C\C#N)c12
Show InChI InChI=1S/C13H14N4O/c1-9(2)7-18-13-11-10(4-3-5-14)6-15-12(11)16-8-17-13/h3-4,6,8-9H,7H2,1-2H3,(H,15,16,17)/b4-3+
US Patent
n/an/a 210n/an/an/an/an/an/a
CONFLUENCE LIFE SCIENCES INC.
US Patent
Assay Description
TAK1-TAB1 Binding Inhibitory Potency: The ability of candidate compounds to interact with TAK1-TAB1 is quantitated by a competitive binding assay usi...
US Patent US9505765 (2016)
BindingDB Entry DOI: 10.7270/Q2T43S1J