null
SMILES: CNC(=O)\C=C\c1c[nH]c2ncnc(OCC(C)C)c12
InChI Key: InChIKey=RQFOIAOPEILIMX-SNAWJCMRSA-N
Activity Spreadsheet -- Enzyme Inhibition Constant Data from BindingDB
Found 1 hit for monomerid = 254949
Trg + Lig
Ki
nM
ΔG°
kcal/mole
IC50
nM
Kd
nM
EC50/IC50
nM
koff
s-1
kon
M-1s-1
pHTemp
°C
Mitogen-activated protein kinase kinase kinase 7/TGF-beta-activated kinase 1 and MAP3K7-binding protein 1
(Homo sapiens (Human))
BDBM254949
(US9505765, 39)
Show SMILES CNC(=O)\C=C\c1c[nH]c2ncnc(OCC(C)C)c12
Show InChI InChI=1S/C14H18N4O2/c1-9(2)7-20-14-12-10(4-5-11(19)15-3)6-16-13(12)17-8-18-14/h4-6,8-9H,7H2,1-3H3,(H,15,19)(H,16,17,18)/b5-4+
US Patent
n/an/a 41n/an/an/an/an/an/a
CONFLUENCE LIFE SCIENCES INC.
US Patent
Assay Description
TAK1-TAB1 Binding Inhibitory Potency: The ability of candidate compounds to interact with TAK1-TAB1 is quantitated by a competitive binding assay usi...
US Patent US9505765 (2016)
BindingDB Entry DOI: 10.7270/Q2T43S1J