BDBM25496 4-(4-chloro-2-fluorophenyl)-2-(2-chloropyridin-4-yl)-N-(6-fluoro-1H-indazol-5-yl)-6-methyl-1,4-dihydropyrimidine-5-carboxamide::Dihydropyrimidine, 25
SMILES: CC1=C(C(NC(=N1)c1ccnc(Cl)c1)c1ccc(Cl)cc1F)C(=O)Nc1cc2cn[nH]c2cc1F
InChI Key: InChIKey=KZYAHEIPPAPADQ-UHFFFAOYSA-N
Data: 1 IC50
Activity Spreadsheet -- Enzyme Inhibition Constant Data from BindingDB
Found 1 hit for monomerid = 25496
Trg + Lig
Ki
nM
ΔG°
kcal/mole
IC50
nM
Kd
nM
EC50/IC50
nM
koff
s-1
kon
M-1s-1
pHTemp
°C
Rho-associated protein kinase 1
(Homo sapiens (Human))
BDBM25496
(4-(4-chloro-2-fluorophenyl)-2-(2-chloropyridin-4-y...)
Show SMILES CC1=C(C(NC(=N1)c1ccnc(Cl)c1)c1ccc(Cl)cc1F)C(=O)Nc1cc2cn[nH]c2cc1F |c:5,t:1|
Show InChI InChI=1S/C24H16Cl2F2N6O/c1-11-21(24(35)32-19-6-13-10-30-34-18(13)9-17(19)28)22(15-3-2-14(25)8-16(15)27)33-23(31-11)12-4-5-29-20(26)7-12/h2-10,22H,1H3,(H,30,34)(H,31,33)(H,32,35)
NCI pathway
Reactome pathway
n/an/a 6n/an/an/an/a7.422
GSK
Assay Description
The assay of Rock-1 activity involved incubation with peptide substrate and ATP33, and the incorporation of P33 into the peptide was quantified by Sc...
J Med Chem 51: 6631-4 (2008)
Article DOI: 10.1021/jm8005096
BindingDB Entry DOI: 10.7270/Q2F47MFZ