null
SMILES: CC(C)(O)COc1ncnc2[nH]cc(\C=C\C(N)=O)c12
InChI Key: InChIKey=LSSSBVSRWFCJKB-ONEGZZNKSA-N
Activity Spreadsheet -- Enzyme Inhibition Constant Data from BindingDB
Found 1 hit for monomerid = 254969
Trg + Lig
Ki
nM
ΔG°
kcal/mole
IC50
nM
Kd
nM
EC50/IC50
nM
koff
s-1
kon
M-1s-1
pHTemp
°C
Mitogen-activated protein kinase kinase kinase 7/TGF-beta-activated kinase 1 and MAP3K7-binding protein 1
(Homo sapiens (Human))
BDBM254969
(US9505765, 193)
Show SMILES CC(C)(O)COc1ncnc2[nH]cc(\C=C\C(N)=O)c12
Show InChI InChI=1S/C13H16N4O3/c1-13(2,19)6-20-12-10-8(3-4-9(14)18)5-15-11(10)16-7-17-12/h3-5,7,19H,6H2,1-2H3,(H2,14,18)(H,15,16,17)/b4-3+
US Patent
n/an/a 75n/an/an/an/an/an/a
CONFLUENCE LIFE SCIENCES INC.
US Patent
Assay Description
TAK1-TAB1 Binding Inhibitory Potency: The ability of candidate compounds to interact with TAK1-TAB1 is quantitated by a competitive binding assay usi...
US Patent US9505765 (2016)
BindingDB Entry DOI: 10.7270/Q2T43S1J