BDBM25499 4-(4-chloro-2-fluorophenyl)-2-(2-ethoxypyridin-4-yl)-N-(6-fluoro-1H-indazol-5-yl)-6-methyl-1,4-dihydropyrimidine-5-carboxamide::Dihydropyrimidine, 28
SMILES: CCOc1cc(ccn1)C1=NC(C)=C(C(N1)c1ccc(Cl)cc1F)C(=O)Nc1cc2cn[nH]c2cc1F
InChI Key: InChIKey=DSPVWAIHVFERDQ-UHFFFAOYSA-N
Data: 1 IC50
Activity Spreadsheet -- Enzyme Inhibition Constant Data from BindingDB
Found 1 hit for monomerid = 25499
Trg + Lig
Ki
nM
ΔG°
kcal/mole
IC50
nM
Kd
nM
EC50/IC50
nM
koff
s-1
kon
M-1s-1
pHTemp
°C
Rho-associated protein kinase 1
(Homo sapiens (Human))
BDBM25499
(4-(4-chloro-2-fluorophenyl)-2-(2-ethoxypyridin-4-y...)
Show SMILES CCOc1cc(ccn1)C1=NC(C)=C(C(N1)c1ccc(Cl)cc1F)C(=O)Nc1cc2cn[nH]c2cc1F |c:13,t:10|
Show InChI InChI=1S/C26H21ClF2N6O2/c1-3-37-22-9-14(6-7-30-22)25-32-13(2)23(24(34-25)17-5-4-16(27)10-18(17)28)26(36)33-21-8-15-12-31-35-20(15)11-19(21)29/h4-12,24H,3H2,1-2H3,(H,31,35)(H,32,34)(H,33,36)
NCI pathway
Reactome pathway
n/an/a 11n/an/an/an/a7.422
GSK
Assay Description
The assay of Rock-1 activity involved incubation with peptide substrate and ATP33, and the incorporation of P33 into the peptide was quantified by Sc...
J Med Chem 51: 6631-4 (2008)
Article DOI: 10.1021/jm8005096
BindingDB Entry DOI: 10.7270/Q2F47MFZ