BDBM255018 US9475813, 23
SMILES: COCN1CN([C@H]2CC[C@H](CNCC(F)(F)F)CC2)c2c(cnc3[nH]ccc23)C1=O
InChI Key:
Data: 4 IC50
Activity Spreadsheet -- Enzyme Inhibition Constant Data from BindingDB
Found 4 hits for monomerid = 255018
Trg + Lig
Ki
nM
ΔG°
kcal/mole
IC50
nM
Kd
nM
EC50/IC50
nM
koff
s-1
kon
M-1s-1
pHTemp
°C
Tyrosine-protein kinase JAK1
(Homo sapiens (Human))
BDBM255018
(US9475813, 23)
Show SMILES COCN1CN([C@H]2CC[C@H](CNCC(F)(F)F)CC2)c2c(cnc3[nH]ccc23)C1=O |r,wU:6.5,wD:9.9,(13.46,-.73,;11.92,-.68,;11.19,.67,;9.65,.72,;8.92,2.08,;7.38,2.13,;6.66,3.48,;5.12,3.53,;4.39,4.89,;5.2,6.2,;4.47,7.56,;2.93,7.6,;2.21,8.96,;.67,9.01,;-.87,9.06,;.71,10.55,;.62,7.47,;6.74,6.15,;7.47,4.79,;6.57,.82,;7.3,-.54,;6.49,-1.85,;4.95,-1.8,;4.22,-.44,;2.73,-.08,;2.61,1.46,;4.04,2.04,;5.03,.87,;8.84,-.59,;9.57,-1.94,)|
Reactome pathway
US Patent
n/an/a 3.80n/an/an/an/an/an/a
Nissan Chemical Industries, Ltd.
US Patent
Assay Description
The inhibitory activity of the compounds of the present invention against JAK was measured.The respective enzymes (JAK1, JAK2, JAK3 and Tyk2) were pu...
US Patent US9475813 (2016)
BindingDB Entry DOI: 10.7270/Q2PC31BN
Non-receptor tyrosine-protein kinase TYK2
(Homo sapiens (Human))
BDBM255018
(US9475813, 23)
Show SMILES COCN1CN([C@H]2CC[C@H](CNCC(F)(F)F)CC2)c2c(cnc3[nH]ccc23)C1=O |r,wU:6.5,wD:9.9,(13.46,-.73,;11.92,-.68,;11.19,.67,;9.65,.72,;8.92,2.08,;7.38,2.13,;6.66,3.48,;5.12,3.53,;4.39,4.89,;5.2,6.2,;4.47,7.56,;2.93,7.6,;2.21,8.96,;.67,9.01,;-.87,9.06,;.71,10.55,;.62,7.47,;6.74,6.15,;7.47,4.79,;6.57,.82,;7.3,-.54,;6.49,-1.85,;4.95,-1.8,;4.22,-.44,;2.73,-.08,;2.61,1.46,;4.04,2.04,;5.03,.87,;8.84,-.59,;9.57,-1.94,)|
US Patent
n/an/a 74n/an/an/an/an/an/a
Nissan Chemical Industries, Ltd.
US Patent
Assay Description
The inhibitory activity of the compounds of the present invention against JAK was measured.The respective enzymes (JAK1, JAK2, JAK3 and Tyk2) were pu...
US Patent US9475813 (2016)
BindingDB Entry DOI: 10.7270/Q2PC31BN
Tyrosine-protein kinase JAK3
(Homo sapiens (Human))
BDBM255018
(US9475813, 23)
Show SMILES COCN1CN([C@H]2CC[C@H](CNCC(F)(F)F)CC2)c2c(cnc3[nH]ccc23)C1=O |r,wU:6.5,wD:9.9,(13.46,-.73,;11.92,-.68,;11.19,.67,;9.65,.72,;8.92,2.08,;7.38,2.13,;6.66,3.48,;5.12,3.53,;4.39,4.89,;5.2,6.2,;4.47,7.56,;2.93,7.6,;2.21,8.96,;.67,9.01,;-.87,9.06,;.71,10.55,;.62,7.47,;6.74,6.15,;7.47,4.79,;6.57,.82,;7.3,-.54,;6.49,-1.85,;4.95,-1.8,;4.22,-.44,;2.73,-.08,;2.61,1.46,;4.04,2.04,;5.03,.87,;8.84,-.59,;9.57,-1.94,)|
Reactome pathway
US Patent
n/an/a 37n/an/an/an/an/an/a
Nissan Chemical Industries, Ltd.
US Patent
Assay Description
The inhibitory activity of the compounds of the present invention against JAK was measured.The respective enzymes (JAK1, JAK2, JAK3 and Tyk2) were pu...
US Patent US9475813 (2016)
BindingDB Entry DOI: 10.7270/Q2PC31BN
Tyrosine-protein kinase JAK2
(Homo sapiens (Human))
BDBM255018
(US9475813, 23)
Show SMILES COCN1CN([C@H]2CC[C@H](CNCC(F)(F)F)CC2)c2c(cnc3[nH]ccc23)C1=O |r,wU:6.5,wD:9.9,(13.46,-.73,;11.92,-.68,;11.19,.67,;9.65,.72,;8.92,2.08,;7.38,2.13,;6.66,3.48,;5.12,3.53,;4.39,4.89,;5.2,6.2,;4.47,7.56,;2.93,7.6,;2.21,8.96,;.67,9.01,;-.87,9.06,;.71,10.55,;.62,7.47,;6.74,6.15,;7.47,4.79,;6.57,.82,;7.3,-.54,;6.49,-1.85,;4.95,-1.8,;4.22,-.44,;2.73,-.08,;2.61,1.46,;4.04,2.04,;5.03,.87,;8.84,-.59,;9.57,-1.94,)|
Reactome pathway
US Patent
n/an/a 10n/an/an/an/an/an/a
Nissan Chemical Industries, Ltd.
US Patent
Assay Description
The inhibitory activity of the compounds of the present invention against JAK was measured.The respective enzymes (JAK1, JAK2, JAK3 and Tyk2) were pu...
US Patent US9475813 (2016)
BindingDB Entry DOI: 10.7270/Q2PC31BN