BDBM25504 1-(2-methoxyphenyl)-3-methyl-N-[(1S)-1-phenylethyl]-1H-pyrazolo[4,3-c]pyridin-6-amine::2-amino-pyrazolopyridine, 9
SMILES: COc1ccccc1-n1nc(C)c2cnc(N[C@@H](C)c3ccccc3)cc12
InChI Key: InChIKey=PHLAPDHHLBMRBX-HNNXBMFYSA-N
Data: 1 IC50
Activity Spreadsheet -- Enzyme Inhibition Constant Data from BindingDB
Found 1 hit for monomerid = 25504
Trg + Lig
Ki
nM
ΔG°
kcal/mole
IC50
nM
Kd
nM
EC50/IC50
nM
koff
s-1
kon
M-1s-1
pHTemp
°C
Serine/threonine-protein kinase PLK1
(Homo sapiens (Human))
BDBM25504
(1-(2-methoxyphenyl)-3-methyl-N-[(1S)-1-phenylethyl...)
Show SMILES COc1ccccc1-n1nc(C)c2cnc(N[C@@H](C)c3ccccc3)cc12 |r|
Show InChI InChI=1S/C22H22N4O/c1-15(17-9-5-4-6-10-17)24-22-13-20-18(14-23-22)16(2)25-26(20)19-11-7-8-12-21(19)27-3/h4-15H,1-3H3,(H,23,24)/t15-/m0/s1
NCI pathway
Reactome pathway
n/an/a 1.45E+4n/an/an/an/a7.230
Sunesis Pharmaceuticals
Assay Description
An IMAP fluorescence polarization-based assay format (Molecular Devices) was used to determine the ability of compounds to inhibit the phosphorylatio...
Bioorg Med Chem Lett 18: 5648-52 (2008)
Article DOI: 10.1016/j.bmcl.2008.08.095
BindingDB Entry DOI: 10.7270/Q29C6VRP