BDBM25520 1-[3-(3-aminopropyl)-5-chlorophenyl]-3-methyl-N-[(1S)-1-phenylethyl]-1H-pyrazolo[4,3-c]pyridin-6-amine::2-amino-pyrazolopyridine, 36
SMILES: C[C@H](Nc1cc2n(nc(C)c2cn1)-c1cc(Cl)cc(CCCN)c1)c1ccccc1
InChI Key: InChIKey=UFNNRSRJIBQSIO-INIZCTEOSA-N
Data: 1 IC50
Activity Spreadsheet -- Enzyme Inhibition Constant Data from BindingDB
Found 1 hit for monomerid = 25520
Trg + Lig
Ki
nM
ΔG°
kcal/mole
IC50
nM
Kd
nM
EC50/IC50
nM
koff
s-1
kon
M-1s-1
pHTemp
°C
Serine/threonine-protein kinase PLK1
(Homo sapiens (Human))
BDBM25520
(1-[3-(3-aminopropyl)-5-chlorophenyl]-3-methyl-N-[(...)
Show SMILES C[C@H](Nc1cc2n(nc(C)c2cn1)-c1cc(Cl)cc(CCCN)c1)c1ccccc1 |r|
Show InChI InChI=1S/C24H26ClN5/c1-16(19-8-4-3-5-9-19)28-24-14-23-22(15-27-24)17(2)29-30(23)21-12-18(7-6-10-26)11-20(25)13-21/h3-5,8-9,11-16H,6-7,10,26H2,1-2H3,(H,27,28)/t16-/m0/s1
NCI pathway
Reactome pathway
n/an/a 59n/an/an/an/a7.230
Sunesis Pharmaceuticals
Assay Description
An IMAP fluorescence polarization-based assay format (Molecular Devices) was used to determine the ability of compounds to inhibit the phosphorylatio...
Bioorg Med Chem Lett 18: 5648-52 (2008)
Article DOI: 10.1016/j.bmcl.2008.08.095
BindingDB Entry DOI: 10.7270/Q29C6VRP