BDBM255210 US9475817, 169
SMILES: Cn1nc(c(c1C1CCN(Cc2ccon2)CC1)-c1ccc2nc(NC(=O)c3ccncc3)cn2n1)-c1ccc(F)cc1
InChI Key: InChIKey=RTICYSKJCBULKS-UHFFFAOYSA-N
Data: 2 IC50
Activity Spreadsheet -- Enzyme Inhibition Constant Data from BindingDB
Found 2 hits for monomerid = 255210
Trg + Lig
Ki
nM
ΔG°
kcal/mole
IC50
nM
Kd
nM
EC50/IC50
nM
koff
s-1
kon
M-1s-1
pHTemp
°C
Casein kinase I isoform delta
(Homo sapiens (Human))
BDBM255210
(US9475817, 169)
Show SMILES Cn1nc(c(c1C1CCN(Cc2ccon2)CC1)-c1ccc2nc(NC(=O)c3ccncc3)cn2n1)-c1ccc(F)cc1
Show InChI InChI=1S/C31H28FN9O2/c1-39-30(21-10-15-40(16-11-21)18-24-12-17-43-38-24)28(29(37-39)20-2-4-23(32)5-3-20)25-6-7-27-34-26(19-41(27)36-25)35-31(42)22-8-13-33-14-9-22/h2-9,12-14,17,19,21H,10-11,15-16,18H2,1H3,(H,35,42)
US Patent
n/an/a 1.40n/an/an/an/a7.425
Bristol-Myers Squibb Company
US Patent
Assay Description
The kinase assay was performed in V-bottom 384-well plates. The final assay volume was 30 ul prepared from 15 ul additions of enzyme, substrates (flu...
US Patent US9475817 (2016)
BindingDB Entry DOI: 10.7270/Q2JQ0ZXH
Casein kinase I isoform epsilon
(Homo sapiens (Human))
BDBM255210
(US9475817, 169)
Show SMILES Cn1nc(c(c1C1CCN(Cc2ccon2)CC1)-c1ccc2nc(NC(=O)c3ccncc3)cn2n1)-c1ccc(F)cc1
Show InChI InChI=1S/C31H28FN9O2/c1-39-30(21-10-15-40(16-11-21)18-24-12-17-43-38-24)28(29(37-39)20-2-4-23(32)5-3-20)25-6-7-27-34-26(19-41(27)36-25)35-31(42)22-8-13-33-14-9-22/h2-9,12-14,17,19,21H,10-11,15-16,18H2,1H3,(H,35,42)
US Patent
n/an/a 0.800n/an/an/an/a7.425
Bristol-Myers Squibb Company
US Patent
Assay Description
The kinase assay was performed in V-bottom 384-well plates. The final assay volume was 30 ul prepared from 15 ul additions of enzyme, substrates (flu...
US Patent US9475817 (2016)
BindingDB Entry DOI: 10.7270/Q2JQ0ZXH