BDBM255217 US9475817, 176
SMILES: Cc1nc(sc1C(=O)Nc1cn2nc(ccc2n1)-c1c(nn(C)c1C1CCN(Cc2ccon2)CC1)-c1ccc(F)cc1)-c1cccnc1
InChI Key: InChIKey=UAVCNSFNYOMUCL-UHFFFAOYSA-N
Data: 2 IC50
Activity Spreadsheet -- Enzyme Inhibition Constant Data from BindingDB
Found 2 hits for monomerid = 255217
Trg + Lig
Ki
nM
ΔG°
kcal/mole
IC50
nM
Kd
nM
EC50/IC50
nM
koff
s-1
kon
M-1s-1
pHTemp
°C
Casein kinase I isoform delta
(Homo sapiens (Human))
BDBM255217
(US9475817, 176)
Show SMILES Cc1nc(sc1C(=O)Nc1cn2nc(ccc2n1)-c1c(nn(C)c1C1CCN(Cc2ccon2)CC1)-c1ccc(F)cc1)-c1cccnc1
Show InChI InChI=1S/C35H31FN10O2S/c1-21-33(49-35(38-21)24-4-3-14-37-18-24)34(47)40-28-20-46-29(39-28)10-9-27(41-46)30-31(22-5-7-25(36)8-6-22)42-44(2)32(30)23-11-15-45(16-12-23)19-26-13-17-48-43-26/h3-10,13-14,17-18,20,23H,11-12,15-16,19H2,1-2H3,(H,40,47)
US Patent
n/an/a 1n/an/an/an/a7.425
Bristol-Myers Squibb Company
US Patent
Assay Description
The kinase assay was performed in V-bottom 384-well plates. The final assay volume was 30 ul prepared from 15 ul additions of enzyme, substrates (flu...
US Patent US9475817 (2016)
BindingDB Entry DOI: 10.7270/Q2JQ0ZXH
Casein kinase I isoform epsilon
(Homo sapiens (Human))
BDBM255217
(US9475817, 176)
Show SMILES Cc1nc(sc1C(=O)Nc1cn2nc(ccc2n1)-c1c(nn(C)c1C1CCN(Cc2ccon2)CC1)-c1ccc(F)cc1)-c1cccnc1
Show InChI InChI=1S/C35H31FN10O2S/c1-21-33(49-35(38-21)24-4-3-14-37-18-24)34(47)40-28-20-46-29(39-28)10-9-27(41-46)30-31(22-5-7-25(36)8-6-22)42-44(2)32(30)23-11-15-45(16-12-23)19-26-13-17-48-43-26/h3-10,13-14,17-18,20,23H,11-12,15-16,19H2,1-2H3,(H,40,47)
US Patent
n/an/a 0.400n/an/an/an/a7.425
Bristol-Myers Squibb Company
US Patent
Assay Description
The kinase assay was performed in V-bottom 384-well plates. The final assay volume was 30 ul prepared from 15 ul additions of enzyme, substrates (flu...
US Patent US9475817 (2016)
BindingDB Entry DOI: 10.7270/Q2JQ0ZXH