BDBM255256 US9481682, 4
SMILES: Nc1nccn2c(nc(-c3ccc(cc3)C(=O)Nc3cc(ccn3)C(F)(F)F)c12)[C@@H]1CC[C@H]2CCC(=O)N2C1
InChI Key: InChIKey=SRSQULBCTWSVKL-MJGOQNOKSA-N
Data: 1 IC50
Activity Spreadsheet -- Enzyme Inhibition Constant Data from BindingDB
Found 18 hits for monomerid = 255256
Trg + Lig
Ki
nM
ΔG°
kcal/mole
IC50
nM
Kd
nM
EC50/IC50
nM
koff
s-1
kon
M-1s-1
pHTemp
°C
Tyrosine-protein kinase BTK
(Homo sapiens (Human))
BDBM255256
(US9481682, 4)
Show SMILES Nc1nccn2c(nc(-c3ccc(cc3)C(=O)Nc3cc(ccn3)C(F)(F)F)c12)[C@@H]1CC[C@H]2CCC(=O)N2C1 |r|
Show InChI InChI=1S/C27H24F3N7O2/c28-27(29,30)18-9-10-32-20(13-18)34-26(39)16-3-1-15(2-4-16)22-23-24(31)33-11-12-36(23)25(35-22)17-5-6-19-7-8-21(38)37(19)14-17/h1-4,9-13,17,19H,5-8,14H2,(H2,31,33)(H,32,34,39)/t17-,19+/m1/s1
NCI pathway
Reactome pathway
US Patent
n/an/a 0.100n/an/an/an/an/an/a
MERCK SHARP & DOHME CORP.
US Patent
Assay Description
BTK enzymatic activity was determined with the LANCE (Lanthanide Chelate Excite) TR-FRET (Time-resolved fluorescence resonance energy transfer) assay...
US Patent US9481682 (2016)
BindingDB Entry DOI: 10.7270/Q2959GGM
VHL/Tyrosine-protein kinase Yes
(Homo sapiens (Human))
BDBM255256
(US9481682, 4)
Show SMILES Nc1nccn2c(nc(-c3ccc(cc3)C(=O)Nc3cc(ccn3)C(F)(F)F)c12)[C@@H]1CC[C@H]2CCC(=O)N2C1 |r|
Show InChI InChI=1S/C27H24F3N7O2/c28-27(29,30)18-9-10-32-20(13-18)34-26(39)16-3-1-15(2-4-16)22-23-24(31)33-11-12-36(23)25(35-22)17-5-6-19-7-8-21(38)37(19)14-17/h1-4,9-13,17,19H,5-8,14H2,(H2,31,33)(H,32,34,39)/t17-,19+/m1/s1
Reactome pathway
n/an/a 12n/an/an/an/an/an/a
TBA
Citation and Details
Tyrosine-protein kinase BTK
(Homo sapiens (Human))
BDBM255256
(US9481682, 4)
Show SMILES Nc1nccn2c(nc(-c3ccc(cc3)C(=O)Nc3cc(ccn3)C(F)(F)F)c12)[C@@H]1CC[C@H]2CCC(=O)N2C1 |r|
Show InChI InChI=1S/C27H24F3N7O2/c28-27(29,30)18-9-10-32-20(13-18)34-26(39)16-3-1-15(2-4-16)22-23-24(31)33-11-12-36(23)25(35-22)17-5-6-19-7-8-21(38)37(19)14-17/h1-4,9-13,17,19H,5-8,14H2,(H2,31,33)(H,32,34,39)/t17-,19+/m1/s1
NCI pathway
Reactome pathway
n/an/a 2.5n/an/an/an/an/an/a
TBA
Citation and Details
Tyrosine-protein kinase BTK
(Homo sapiens (Human))
BDBM255256
(US9481682, 4)
Show SMILES Nc1nccn2c(nc(-c3ccc(cc3)C(=O)Nc3cc(ccn3)C(F)(F)F)c12)[C@@H]1CC[C@H]2CCC(=O)N2C1 |r|
Show InChI InChI=1S/C27H24F3N7O2/c28-27(29,30)18-9-10-32-20(13-18)34-26(39)16-3-1-15(2-4-16)22-23-24(31)33-11-12-36(23)25(35-22)17-5-6-19-7-8-21(38)37(19)14-17/h1-4,9-13,17,19H,5-8,14H2,(H2,31,33)(H,32,34,39)/t17-,19+/m1/s1
NCI pathway
Reactome pathway
n/an/a 24n/an/an/an/an/an/a
TBA
Citation and Details
SRC
(Homo sapiens (Human))
BDBM255256
(US9481682, 4)
Show SMILES Nc1nccn2c(nc(-c3ccc(cc3)C(=O)Nc3cc(ccn3)C(F)(F)F)c12)[C@@H]1CC[C@H]2CCC(=O)N2C1 |r|
Show InChI InChI=1S/C27H24F3N7O2/c28-27(29,30)18-9-10-32-20(13-18)34-26(39)16-3-1-15(2-4-16)22-23-24(31)33-11-12-36(23)25(35-22)17-5-6-19-7-8-21(38)37(19)14-17/h1-4,9-13,17,19H,5-8,14H2,(H2,31,33)(H,32,34,39)/t17-,19+/m1/s1
Reactome pathway
n/an/a 8.30n/an/an/an/an/an/a
TBA
Citation and Details
Cytoplasmic tyrosine-protein kinase BMX
(Homo sapiens (Human))
BDBM255256
(US9481682, 4)
Show SMILES Nc1nccn2c(nc(-c3ccc(cc3)C(=O)Nc3cc(ccn3)C(F)(F)F)c12)[C@@H]1CC[C@H]2CCC(=O)N2C1 |r|
Show InChI InChI=1S/C27H24F3N7O2/c28-27(29,30)18-9-10-32-20(13-18)34-26(39)16-3-1-15(2-4-16)22-23-24(31)33-11-12-36(23)25(35-22)17-5-6-19-7-8-21(38)37(19)14-17/h1-4,9-13,17,19H,5-8,14H2,(H2,31,33)(H,32,34,39)/t17-,19+/m1/s1
NCI pathway
Reactome pathway
n/an/a 11n/an/an/an/an/an/a
TBA
Citation and Details
Tyrosine-protein kinase CSK
(Homo sapiens (Human))
BDBM255256
(US9481682, 4)
Show SMILES Nc1nccn2c(nc(-c3ccc(cc3)C(=O)Nc3cc(ccn3)C(F)(F)F)c12)[C@@H]1CC[C@H]2CCC(=O)N2C1 |r|
Show InChI InChI=1S/C27H24F3N7O2/c28-27(29,30)18-9-10-32-20(13-18)34-26(39)16-3-1-15(2-4-16)22-23-24(31)33-11-12-36(23)25(35-22)17-5-6-19-7-8-21(38)37(19)14-17/h1-4,9-13,17,19H,5-8,14H2,(H2,31,33)(H,32,34,39)/t17-,19+/m1/s1
NCI pathway
Reactome pathway
n/an/a 162n/an/an/an/an/an/a
TBA
Citation and Details
Epidermal growth factor receptor
(Homo sapiens (Human))
BDBM255256
(US9481682, 4)
Show SMILES Nc1nccn2c(nc(-c3ccc(cc3)C(=O)Nc3cc(ccn3)C(F)(F)F)c12)[C@@H]1CC[C@H]2CCC(=O)N2C1 |r|
Show InChI InChI=1S/C27H24F3N7O2/c28-27(29,30)18-9-10-32-20(13-18)34-26(39)16-3-1-15(2-4-16)22-23-24(31)33-11-12-36(23)25(35-22)17-5-6-19-7-8-21(38)37(19)14-17/h1-4,9-13,17,19H,5-8,14H2,(H2,31,33)(H,32,34,39)/t17-,19+/m1/s1
n/an/a 24n/an/an/an/an/an/a
TBA
Citation and Details
SRC
(Homo sapiens (Human))
BDBM255256
(US9481682, 4)
Show SMILES Nc1nccn2c(nc(-c3ccc(cc3)C(=O)Nc3cc(ccn3)C(F)(F)F)c12)[C@@H]1CC[C@H]2CCC(=O)N2C1 |r|
Show InChI InChI=1S/C27H24F3N7O2/c28-27(29,30)18-9-10-32-20(13-18)34-26(39)16-3-1-15(2-4-16)22-23-24(31)33-11-12-36(23)25(35-22)17-5-6-19-7-8-21(38)37(19)14-17/h1-4,9-13,17,19H,5-8,14H2,(H2,31,33)(H,32,34,39)/t17-,19+/m1/s1
n/an/a 34n/an/an/an/an/an/a
TBA
Citation and Details
SRC
(Homo sapiens (Human))
BDBM255256
(US9481682, 4)
Show SMILES Nc1nccn2c(nc(-c3ccc(cc3)C(=O)Nc3cc(ccn3)C(F)(F)F)c12)[C@@H]1CC[C@H]2CCC(=O)N2C1 |r|
Show InChI InChI=1S/C27H24F3N7O2/c28-27(29,30)18-9-10-32-20(13-18)34-26(39)16-3-1-15(2-4-16)22-23-24(31)33-11-12-36(23)25(35-22)17-5-6-19-7-8-21(38)37(19)14-17/h1-4,9-13,17,19H,5-8,14H2,(H2,31,33)(H,32,34,39)/t17-,19+/m1/s1
n/an/a 87n/an/an/an/an/an/a
TBA
Citation and Details
Tyrosine-protein kinase Lck
(Homo sapiens (Human))
BDBM255256
(US9481682, 4)
Show SMILES Nc1nccn2c(nc(-c3ccc(cc3)C(=O)Nc3cc(ccn3)C(F)(F)F)c12)[C@@H]1CC[C@H]2CCC(=O)N2C1 |r|
Show InChI InChI=1S/C27H24F3N7O2/c28-27(29,30)18-9-10-32-20(13-18)34-26(39)16-3-1-15(2-4-16)22-23-24(31)33-11-12-36(23)25(35-22)17-5-6-19-7-8-21(38)37(19)14-17/h1-4,9-13,17,19H,5-8,14H2,(H2,31,33)(H,32,34,39)/t17-,19+/m1/s1
n/an/a 5.90n/an/an/an/an/an/a
TBA
Citation and Details
Tyrosine-protein kinase Lyn
(Homo sapiens (Human))
BDBM255256
(US9481682, 4)
Show SMILES Nc1nccn2c(nc(-c3ccc(cc3)C(=O)Nc3cc(ccn3)C(F)(F)F)c12)[C@@H]1CC[C@H]2CCC(=O)N2C1 |r|
Show InChI InChI=1S/C27H24F3N7O2/c28-27(29,30)18-9-10-32-20(13-18)34-26(39)16-3-1-15(2-4-16)22-23-24(31)33-11-12-36(23)25(35-22)17-5-6-19-7-8-21(38)37(19)14-17/h1-4,9-13,17,19H,5-8,14H2,(H2,31,33)(H,32,34,39)/t17-,19+/m1/s1
Reactome pathway
n/an/a 20n/an/an/an/an/an/a
TBA
Citation and Details
Tyrosine-protein kinase BRK
(Homo sapiens (Human))
BDBM255256
(US9481682, 4)
Show SMILES Nc1nccn2c(nc(-c3ccc(cc3)C(=O)Nc3cc(ccn3)C(F)(F)F)c12)[C@@H]1CC[C@H]2CCC(=O)N2C1 |r|
Show InChI InChI=1S/C27H24F3N7O2/c28-27(29,30)18-9-10-32-20(13-18)34-26(39)16-3-1-15(2-4-16)22-23-24(31)33-11-12-36(23)25(35-22)17-5-6-19-7-8-21(38)37(19)14-17/h1-4,9-13,17,19H,5-8,14H2,(H2,31,33)(H,32,34,39)/t17-,19+/m1/s1
n/an/a 42n/an/an/an/an/an/a
TBA
Citation and Details
Protein cereblon/Tyrosine-protein kinase SRC
(Homo sapiens (Human))
BDBM255256
(US9481682, 4)
Show SMILES Nc1nccn2c(nc(-c3ccc(cc3)C(=O)Nc3cc(ccn3)C(F)(F)F)c12)[C@@H]1CC[C@H]2CCC(=O)N2C1 |r|
Show InChI InChI=1S/C27H24F3N7O2/c28-27(29,30)18-9-10-32-20(13-18)34-26(39)16-3-1-15(2-4-16)22-23-24(31)33-11-12-36(23)25(35-22)17-5-6-19-7-8-21(38)37(19)14-17/h1-4,9-13,17,19H,5-8,14H2,(H2,31,33)(H,32,34,39)/t17-,19+/m1/s1
n/an/a 33n/an/an/an/an/an/a
TBA
Citation and Details
SRC
(Homo sapiens (Human))
BDBM255256
(US9481682, 4)
Show SMILES Nc1nccn2c(nc(-c3ccc(cc3)C(=O)Nc3cc(ccn3)C(F)(F)F)c12)[C@@H]1CC[C@H]2CCC(=O)N2C1 |r|
Show InChI InChI=1S/C27H24F3N7O2/c28-27(29,30)18-9-10-32-20(13-18)34-26(39)16-3-1-15(2-4-16)22-23-24(31)33-11-12-36(23)25(35-22)17-5-6-19-7-8-21(38)37(19)14-17/h1-4,9-13,17,19H,5-8,14H2,(H2,31,33)(H,32,34,39)/t17-,19+/m1/s1
Reactome pathway
n/an/a 9.10n/an/an/an/an/an/a
TBA
Citation and Details
Tyrosine-protein kinase TEC
(Homo sapiens (Human))
BDBM255256
(US9481682, 4)
Show SMILES Nc1nccn2c(nc(-c3ccc(cc3)C(=O)Nc3cc(ccn3)C(F)(F)F)c12)[C@@H]1CC[C@H]2CCC(=O)N2C1 |r|
Show InChI InChI=1S/C27H24F3N7O2/c28-27(29,30)18-9-10-32-20(13-18)34-26(39)16-3-1-15(2-4-16)22-23-24(31)33-11-12-36(23)25(35-22)17-5-6-19-7-8-21(38)37(19)14-17/h1-4,9-13,17,19H,5-8,14H2,(H2,31,33)(H,32,34,39)/t17-,19+/m1/s1
Reactome pathway
n/an/a 63n/an/an/an/an/an/a
TBA
Citation and Details
Tyrosine-protein kinase TXK
(Homo sapiens (Human))
BDBM255256
(US9481682, 4)
Show SMILES Nc1nccn2c(nc(-c3ccc(cc3)C(=O)Nc3cc(ccn3)C(F)(F)F)c12)[C@@H]1CC[C@H]2CCC(=O)N2C1 |r|
Show InChI InChI=1S/C27H24F3N7O2/c28-27(29,30)18-9-10-32-20(13-18)34-26(39)16-3-1-15(2-4-16)22-23-24(31)33-11-12-36(23)25(35-22)17-5-6-19-7-8-21(38)37(19)14-17/h1-4,9-13,17,19H,5-8,14H2,(H2,31,33)(H,32,34,39)/t17-,19+/m1/s1
n/an/a 33n/an/an/an/an/an/a
TBA
Citation and Details
Tyrosine-protein kinase BTK
(Homo sapiens (Human))
BDBM255256
(US9481682, 4)
Show SMILES Nc1nccn2c(nc(-c3ccc(cc3)C(=O)Nc3cc(ccn3)C(F)(F)F)c12)[C@@H]1CC[C@H]2CCC(=O)N2C1 |r|
Show InChI InChI=1S/C27H24F3N7O2/c28-27(29,30)18-9-10-32-20(13-18)34-26(39)16-3-1-15(2-4-16)22-23-24(31)33-11-12-36(23)25(35-22)17-5-6-19-7-8-21(38)37(19)14-17/h1-4,9-13,17,19H,5-8,14H2,(H2,31,33)(H,32,34,39)/t17-,19+/m1/s1
NCI pathway
Reactome pathway
n/an/a 0.100n/an/an/an/an/an/a
TBA
Citation and Details