BDBM255267 US9481682, 16
SMILES: Nc1nccn2c(nc(-c3ccc(cc3F)C(=O)Nc3cc(ccn3)C3CC3)c12)[C@@H]1CC[C@H]2CCC(=O)N2C1
InChI Key: InChIKey=KLFBIFAIEJPNJN-UXHICEINSA-N
Data: 1 IC50
Activity Spreadsheet -- Enzyme Inhibition Constant Data from BindingDB
Found 1 hit for monomerid = 255267
Trg + Lig
Ki
nM
ΔG°
kcal/mole
IC50
nM
Kd
nM
EC50/IC50
nM
koff
s-1
kon
M-1s-1
pHTemp
°C
Tyrosine-protein kinase BTK
(Homo sapiens (Human))
BDBM255267
(US9481682, 16)
Show SMILES Nc1nccn2c(nc(-c3ccc(cc3F)C(=O)Nc3cc(ccn3)C3CC3)c12)[C@@H]1CC[C@H]2CCC(=O)N2C1 |r|
Show InChI InChI=1S/C29H28FN7O2/c30-22-13-18(29(39)34-23-14-17(9-10-32-23)16-1-2-16)4-7-21(22)25-26-27(31)33-11-12-36(26)28(35-25)19-3-5-20-6-8-24(38)37(20)15-19/h4,7,9-14,16,19-20H,1-3,5-6,8,15H2,(H2,31,33)(H,32,34,39)/t19-,20+/m1/s1
NCI pathway
Reactome pathway
US Patent
n/an/a 0.200n/an/an/an/an/an/a
MERCK SHARP & DOHME CORP.
US Patent
Assay Description
BTK enzymatic activity was determined with the LANCE (Lanthanide Chelate Excite) TR-FRET (Time-resolved fluorescence resonance energy transfer) assay...
US Patent US9481682 (2016)
BindingDB Entry DOI: 10.7270/Q2959GGM