BDBM255269 US9481682, 18
SMILES: CCc1ccnc(NC(=O)c2ccc(cc2)-c2nc([C@@H]3CC[C@H]4CCC(=O)N4C3)n3ccnc(N)c23)c1
InChI Key: InChIKey=WDYAOTIRWNOXLL-RTWAWAEBSA-N
Data: 1 IC50
Activity Spreadsheet -- Enzyme Inhibition Constant Data from BindingDB
Found 1 hit for monomerid = 255269
Trg + Lig
Ki
nM
ΔG°
kcal/mole
IC50
nM
Kd
nM
EC50/IC50
nM
koff
s-1
kon
M-1s-1
pHTemp
°C
Tyrosine-protein kinase BTK
(Homo sapiens (Human))
BDBM255269
(US9481682, 18)
Show SMILES CCc1ccnc(NC(=O)c2ccc(cc2)-c2nc([C@@H]3CC[C@H]4CCC(=O)N4C3)n3ccnc(N)c23)c1 |r|
Show InChI InChI=1S/C28H29N7O2/c1-2-17-11-12-30-22(15-17)32-28(37)19-5-3-18(4-6-19)24-25-26(29)31-13-14-34(25)27(33-24)20-7-8-21-9-10-23(36)35(21)16-20/h3-6,11-15,20-21H,2,7-10,16H2,1H3,(H2,29,31)(H,30,32,37)/t20-,21+/m1/s1
NCI pathway
Reactome pathway
US Patent
n/an/a 0.160n/an/an/an/an/an/a
MERCK SHARP & DOHME CORP.
US Patent
Assay Description
BTK enzymatic activity was determined with the LANCE (Lanthanide Chelate Excite) TR-FRET (Time-resolved fluorescence resonance energy transfer) assay...
US Patent US9481682 (2016)
BindingDB Entry DOI: 10.7270/Q2959GGM