BDBM255283 US9481682, 32
SMILES: C[C@H]1OC(=O)N2C[C@@H](CC[C@@H]12)c1nc(-c2ccc(cc2F)C(=O)Nc2cc(ccn2)C2CC2)c2c(N)nccn12
InChI Key: InChIKey=UWQYMBWFDOHMGS-YOMUGFJLSA-N
Data: 1 IC50
Activity Spreadsheet -- Enzyme Inhibition Constant Data from BindingDB
Found 1 hit for monomerid = 255283
Trg + Lig
Ki
nM
ΔG°
kcal/mole
IC50
nM
Kd
nM
EC50/IC50
nM
koff
s-1
kon
M-1s-1
pHTemp
°C
Tyrosine-protein kinase BTK
(Homo sapiens (Human))
BDBM255283
(US9481682, 32)
Show SMILES C[C@H]1OC(=O)N2C[C@@H](CC[C@@H]12)c1nc(-c2ccc(cc2F)C(=O)Nc2cc(ccn2)C2CC2)c2c(N)nccn12 |r|
Show InChI InChI=1S/C29H28FN7O3/c1-15-22-7-5-19(14-37(22)29(39)40-15)27-35-24(25-26(31)33-10-11-36(25)27)20-6-4-18(12-21(20)30)28(38)34-23-13-17(8-9-32-23)16-2-3-16/h4,6,8-13,15-16,19,22H,2-3,5,7,14H2,1H3,(H2,31,33)(H,32,34,38)/t15-,19-,22+/m1/s1
NCI pathway
Reactome pathway
US Patent
n/an/a 0.210n/an/an/an/an/an/a
MERCK SHARP & DOHME CORP.
US Patent
Assay Description
BTK enzymatic activity was determined with the LANCE (Lanthanide Chelate Excite) TR-FRET (Time-resolved fluorescence resonance energy transfer) assay...
US Patent US9481682 (2016)
BindingDB Entry DOI: 10.7270/Q2959GGM