BDBM255316 US9481682, 65
SMILES: C[C@H]1CC(=O)N2C[C@@H](CC[C@@H]12)c1nc(-c2ccc(cc2)C(=O)Nc2cc(ccn2)C(F)(F)F)c2c(N)nccn12
InChI Key: InChIKey=YQHLUKXYMYTFGM-CVAIRZPRSA-N
Data: 1 IC50
Activity Spreadsheet -- Enzyme Inhibition Constant Data from BindingDB
Found 1 hit for monomerid = 255316
Trg + Lig
Ki
nM
ΔG°
kcal/mole
IC50
nM
Kd
nM
EC50/IC50
nM
koff
s-1
kon
M-1s-1
pHTemp
°C
Tyrosine-protein kinase BTK
(Homo sapiens (Human))
BDBM255316
(US9481682, 65)
Show SMILES C[C@H]1CC(=O)N2C[C@@H](CC[C@@H]12)c1nc(-c2ccc(cc2)C(=O)Nc2cc(ccn2)C(F)(F)F)c2c(N)nccn12 |r|
Show InChI InChI=1S/C28H26F3N7O2/c1-15-12-22(39)38-14-18(6-7-20(15)38)26-36-23(24-25(32)34-10-11-37(24)26)16-2-4-17(5-3-16)27(40)35-21-13-19(8-9-33-21)28(29,30)31/h2-5,8-11,13,15,18,20H,6-7,12,14H2,1H3,(H2,32,34)(H,33,35,40)/t15-,18+,20-/m0/s1
NCI pathway
Reactome pathway
US Patent
n/an/a 0.0850n/an/an/an/an/an/a
MERCK SHARP & DOHME CORP.
US Patent
Assay Description
BTK enzymatic activity was determined with the LANCE (Lanthanide Chelate Excite) TR-FRET (Time-resolved fluorescence resonance energy transfer) assay...
US Patent US9481682 (2016)
BindingDB Entry DOI: 10.7270/Q2959GGM