null
SMILES: OCCCn1ncc2cc(Nc3ncc(F)c(Nc4cccc(O)c4)n3)ccc12
InChI Key: InChIKey=KRDWLRVIBCQDNS-UHFFFAOYSA-N
Activity Spreadsheet -- Enzyme Inhibition Constant Data from BindingDB
Found 2 hits for monomerid = 255509
Trg + Lig
Ki
nM
ΔG°
kcal/mole
IC50
nM
Kd
nM
EC50/IC50
nM
koff
s-1
kon
M-1s-1
pHTemp
°C
Tyrosine-protein kinase SYK
(Homo sapiens (Human))
BDBM255509
(US10828301, Compound R935304 | US9499493, R935304)
Show SMILES OCCCn1ncc2cc(Nc3ncc(F)c(Nc4cccc(O)c4)n3)ccc12
Show InChI InChI=1S/C20H19FN6O2/c21-17-12-22-20(26-19(17)24-14-3-1-4-16(29)10-14)25-15-5-6-18-13(9-15)11-23-27(18)7-2-8-28/h1,3-6,9-12,28-29H,2,7-8H2,(H2,22,24,25,26)
NCI pathway
Reactome pathway
US Patent
n/an/a 42n/an/an/an/an/an/a
Rigel Pharmceuticals, Inc.
US Patent
Assay Description
Several 2,4-pyrimidinediamine compounds were tested for the ability to inhibit Syk kinase catalyzed phosphorylation of a peptide substrate in a bioch...
US Patent US10828301 (2020)
Tyrosine-protein kinase SYK
(Homo sapiens (Human))
BDBM255509
(US10828301, Compound R935304 | US9499493, R935304)
Show SMILES OCCCn1ncc2cc(Nc3ncc(F)c(Nc4cccc(O)c4)n3)ccc12
Show InChI InChI=1S/C20H19FN6O2/c21-17-12-22-20(26-19(17)24-14-3-1-4-16(29)10-14)25-15-5-6-18-13(9-15)11-23-27(18)7-2-8-28/h1,3-6,9-12,28-29H,2,7-8H2,(H2,22,24,25,26)
NCI pathway
Reactome pathway
US Patent
n/an/a 42n/an/an/an/a7.425
Rigel Pharmaceuticals, Inc.
US Patent
Assay Description
Several 2,4-pyrimidinediamine compounds were tested for the ability to inhibit Syk kinase catalyzed phosphorylation of a peptide substrate in a bioch...
US Patent US9499493 (2016)
BindingDB Entry DOI: 10.7270/Q2WW7GKQ