BDBM255513 US10828301, Compound R940338::US9499493, R940338
SMILES: Cn1ncc2cc(Nc3ncc(F)c(Nc4ccc5OC(C)(C)C(=O)Nc5c4)n3)ccc12
InChI Key: InChIKey=YJZNNCBZUHWOEH-UHFFFAOYSA-N
Data: 2 IC50
Activity Spreadsheet -- Enzyme Inhibition Constant Data from BindingDB
Found 2 hits for monomerid = 255513
Trg + Lig
Ki
nM
ΔG°
kcal/mole
IC50
nM
Kd
nM
EC50/IC50
nM
koff
s-1
kon
M-1s-1
pHTemp
°C
Tyrosine-protein kinase SYK
(Homo sapiens (Human))
BDBM255513
(US10828301, Compound R940338 | US9499493, R940338)
Show SMILES Cn1ncc2cc(Nc3ncc(F)c(Nc4ccc5OC(C)(C)C(=O)Nc5c4)n3)ccc12
Show InChI InChI=1S/C22H20FN7O2/c1-22(2)20(31)28-16-9-14(5-7-18(16)32-22)26-19-15(23)11-24-21(29-19)27-13-4-6-17-12(8-13)10-25-30(17)3/h4-11H,1-3H3,(H,28,31)(H2,24,26,27,29)
NCI pathway
Reactome pathway
US Patent
n/an/a 28n/an/an/an/an/an/a
Rigel Pharmceuticals, Inc.
US Patent
Assay Description
Several 2,4-pyrimidinediamine compounds were tested for the ability to inhibit Syk kinase catalyzed phosphorylation of a peptide substrate in a bioch...
US Patent US10828301 (2020)
Tyrosine-protein kinase SYK
(Homo sapiens (Human))
BDBM255513
(US10828301, Compound R940338 | US9499493, R940338)
Show SMILES Cn1ncc2cc(Nc3ncc(F)c(Nc4ccc5OC(C)(C)C(=O)Nc5c4)n3)ccc12
Show InChI InChI=1S/C22H20FN7O2/c1-22(2)20(31)28-16-9-14(5-7-18(16)32-22)26-19-15(23)11-24-21(29-19)27-13-4-6-17-12(8-13)10-25-30(17)3/h4-11H,1-3H3,(H,28,31)(H2,24,26,27,29)
NCI pathway
Reactome pathway
US Patent
n/an/a 28n/an/an/an/a7.425
Rigel Pharmaceuticals, Inc.
US Patent
Assay Description
Several 2,4-pyrimidinediamine compounds were tested for the ability to inhibit Syk kinase catalyzed phosphorylation of a peptide substrate in a bioch...
US Patent US9499493 (2016)
BindingDB Entry DOI: 10.7270/Q2WW7GKQ