BDBM25558 4-arylamino-3-pyridinecarbonitrile, 4p::5-(3,4-dimethoxyphenyl)-4-(1H-indol-5-ylamino)pyridine-3-carbonitrile::BMCL192461 Compound 1a::CHEMBL492251
SMILES: COc1ccc(cc1OC)-c1cncc(C#N)c1Nc1ccc2[nH]ccc2c1
InChI Key: InChIKey=KPDRLZMGHJWHQC-UHFFFAOYSA-N
Data: 1 KI  4 IC50
Activity Spreadsheet -- Enzyme Inhibition Constant Data from BindingDB
Found 4 hits for monomerid = 25558
Trg + Lig
Ki
nM
ΔG°
kcal/mole
IC50
nM
Kd
nM
EC50/IC50
nM
koff
s-1
kon
M-1s-1
pHTemp
°C
Protein kinase C theta type
(Homo sapiens (Human))
BDBM25558
(4-arylamino-3-pyridinecarbonitrile, 4p | 5-(3,4-di...)
Show SMILES COc1ccc(cc1OC)-c1cncc(C#N)c1Nc1ccc2[nH]ccc2c1
Show InChI InChI=1S/C22H18N4O2/c1-27-20-6-3-14(10-21(20)28-2)18-13-24-12-16(11-23)22(18)26-17-4-5-19-15(9-17)7-8-25-19/h3-10,12-13,25H,1-2H3,(H,24,26)
NCI pathway
Reactome pathway
79 -9.58 70n/an/an/an/a7.222
Wyeth Research
Assay Description
All IC50s were measured by using a modified IMAP protocol from Molecular Devices. The kinase reaction was carried out in a Corning Costar 384 well pl...
J Med Chem 51: 5958-63 (2008)
Article DOI: 10.1021/jm800214a
BindingDB Entry DOI: 10.7270/Q21V5C8K
Protein kinase C theta type
(Homo sapiens (Human))
BDBM25558
(4-arylamino-3-pyridinecarbonitrile, 4p | 5-(3,4-di...)
Show SMILES COc1ccc(cc1OC)-c1cncc(C#N)c1Nc1ccc2[nH]ccc2c1
Show InChI InChI=1S/C22H18N4O2/c1-27-20-6-3-14(10-21(20)28-2)18-13-24-12-16(11-23)22(18)26-17-4-5-19-15(9-17)7-8-25-19/h3-10,12-13,25H,1-2H3,(H,24,26)
NCI pathway
Reactome pathway
n/an/a 70n/an/an/an/an/an/a
Wyeth Research
Curated by ChEMBL
Assay Description
Inhibition of human PKCtheta by IMAP assay
Bioorg Med Chem Lett 19: 3623-6 (2009)
Article DOI: 10.1016/j.bmcl.2009.04.126
BindingDB Entry DOI: 10.7270/Q29W0FD4
Protein kinase C delta type
(Homo sapiens (Human))
BDBM25558
(4-arylamino-3-pyridinecarbonitrile, 4p | 5-(3,4-di...)
Show SMILES COc1ccc(cc1OC)-c1cncc(C#N)c1Nc1ccc2[nH]ccc2c1
Show InChI InChI=1S/C22H18N4O2/c1-27-20-6-3-14(10-21(20)28-2)18-13-24-12-16(11-23)22(18)26-17-4-5-19-15(9-17)7-8-25-19/h3-10,12-13,25H,1-2H3,(H,24,26)
NCI pathway
Reactome pathway
n/an/a 350n/an/an/an/an/an/a
Wyeth Research
Curated by ChEMBL
Assay Description
Inhibition of human PKCdelta by IMAP assay
Bioorg Med Chem Lett 19: 3623-6 (2009)
Article DOI: 10.1016/j.bmcl.2009.04.126
BindingDB Entry DOI: 10.7270/Q29W0FD4
Protein kinase C theta type
(Homo sapiens (Human))
BDBM25558
(4-arylamino-3-pyridinecarbonitrile, 4p | 5-(3,4-di...)
Show SMILES COc1ccc(cc1OC)-c1cncc(C#N)c1Nc1ccc2[nH]ccc2c1
Show InChI InChI=1S/C22H18N4O2/c1-27-20-6-3-14(10-21(20)28-2)18-13-24-12-16(11-23)22(18)26-17-4-5-19-15(9-17)7-8-25-19/h3-10,12-13,25H,1-2H3,(H,24,26)
NCI pathway
Reactome pathway
n/an/a 70n/an/an/an/a7.222
Wyeth Research
Assay Description
All IC50s were measured by using a modified IMAP protocol from Molecular Devices. The kinase reaction was carried out in a Corning Costar 384 well pl...
Bioorg Med Chem Lett 19: 2461-3 (2009)
Article DOI: 10.1016/j.bmcl.2009.03.053
BindingDB Entry DOI: 10.7270/Q21R6NVV