BDBM255774 (3aR,5R,6S,7S,7aR)-5- (hydroxymethyl)-2-(methylamino)- 5,6,7,7a-tetrahydro-3aH-pyrano[3,2- d]thiazole-6,7-diol::US9701693, 4
SMILES: CNC1=N[C@H]2[C@H](O[C@H](CO)[C@@H](O)[C@H]2O)S1
InChI Key: InChIKey=RPZPRSQYGSVMTF-BNWJMWRWSA-N
Data: 1 KI
Activity Spreadsheet -- Enzyme Inhibition Constant Data from BindingDB
Found 1 hit for monomerid = 255774
Trg + Lig
Ki
nM
ΔG°
kcal/mole
IC50
nM
Kd
nM
EC50/IC50
nM
koff
s-1
kon
M-1s-1
pHTemp
°C
N-acetyl-beta-D-glucosaminidase (O-GlcNAcase)
(Homo sapiens (Human))
BDBM255774
((3aR,5R,6S,7S,7aR)-5- (hydroxymethyl)-2-(methylami...)
Show SMILES CNC1=N[C@H]2[C@H](O[C@H](CO)[C@@H](O)[C@H]2O)S1 |r,t:2|
Show InChI InChI=1S/C8H14N2O4S/c1-9-8-10-4-6(13)5(12)3(2-11)14-7(4)15-8/h3-7,11-13H,2H2,1H3,(H,9,10)/t3-,4-,5-,6+,7-/m1/s1
US Patent
0.700 -12.5n/an/an/an/an/an/a25
Alectos Therapeutics Inc.; Merck Sharp & Dohme Corp.
US Patent
Assay Description
A variety of tissue culture cell lines, expressing endogenous levels of O-GlcNAcase, can be utilized; examples include rat PC-12, and human U-87, or ...
US Patent US9701693 (2017)
BindingDB Entry DOI: 10.7270/Q21J9CT5